1,4,7,10,13,16-Hexaoxacyclooctadecane
- Formula: C12H24O6
- Molecular weight: 264.3154
- IUPAC Standard InChIKey: XEZNGIUYQVAUSS-UHFFFAOYSA-N
- CAS Registry Number: 17455-13-9
- Chemical structure:
View 3d structure (requires JavaScript / HTML 5) - Other names: Ethylene oxide cyclic hexamer; 18-Crown-6; 18-Crown-6 ether; Crown ether 18-crown-6

Condensed phase thermochemistry data

Data compiled by: Hussein Y. Afeefy, Joel F. Liebman, and Stephen E. Stein
Quantity | Value | Units | Method | Reference | Comment |
---|---|---|---|---|---|
ΔcH°liquid | -7061.8 ± 7.5 | kJ/mol | Ccb | Moses and Larson, 1980 | Corresponding ΔfHºliquid = -1090.3 kJ/mol (simple calculation by NIST; no Washburn corrections) |
Quantity | Value | Units | Method | Reference | Comment |
ΔfH°solid | -1081.1 ± 2.8 | kJ/mol | Ccb | Vasil'ev, Borodin, et al., 1992 | Authors Hf298_condensed=-1037.0±2.8 kJ/mol |
Quantity | Value | Units | Method | Reference | Comment |
ΔcH°solid | -7071.0 ± 4.9 | kJ/mol | Ccb | Vasil'ev, Borodin, et al., 1992 | Authors Hf298_condensed=-1037.0±2.8 kJ/mol; Corresponding ΔfHºsolid = -1081.1 kJ/mol (simple calculation by NIST; no Washburn corrections) |

Phase change data

Data compiled as indicated in comments:
BS - Robert L. Brown and Stephen E. Stein
TRC - Thermodynamics Research Center, NIST Boulder Laboratories, Chris Muzny director
AC - William E. Acree, Jr., James S. Chickos
Quantity | Value | Units | Method | Reference | Comment |
---|---|---|---|---|---|
Tfus | 310. | K | N/A | Dale and Kristiansen, 1972 | Uncertainty assigned by TRC = 1. K; TRC |
Quantity | Value | Units | Method | Reference | Comment |
ΔvapH° | 86.1 ± 6.7 | kJ/mol | CGC | Nichols, Orf, et al., 2000 | AC |
Quantity | Value | Units | Method | Reference | Comment |
ΔsubH° | 119.1 ± 6.7 | kJ/mol | CGC-DSC | Nichols, Orf, et al., 2000 | AC |
Reduced pressure boiling point
Tboil (K) | Pressure (bar) | Reference | Comment |
---|---|---|---|
391. to 392. | 0.00007 | PCR Inc., 1990 | BS |
Enthalpy of fusion
ΔfusH (kJ/mol) | Temperature (K) | Reference | Comment |
---|---|---|---|
34.0 | 312.2 | Dale, Kristiansen, et al., 1972 | AC |

Reaction thermochemistry data

Data compiled as indicated in comments:
M - Michael M. Meot-Ner (Mautner) and Sharon G. Lias
RCD - Robert C. Dunbar
Individual Reactions
By formula: C4H5N2+ + C12H24O6 = (C4H5N2+ • C12H24O6)
Bond type: Hydrogen bonds with polydentate bonding in positive ions
Quantity | Value | Units | Method | Reference | Comment |
---|---|---|---|---|---|
ΔrH° | 180. ± 20. | kJ/mol | PHPMS | Meot-Ner (Mautner), 1983 | gas phase; Entropy change calculated or estimated; M |
Quantity | Value | Units | Method | Reference | Comment |
ΔrS° | 180. | J/mol*K | N/A | Meot-Ner (Mautner), 1983 | gas phase; Entropy change calculated or estimated; M |
Free energy of reaction
ΔrG° (kJ/mol) | T (K) | Method | Reference | Comment |
---|---|---|---|---|
67. | 600. | PHPMS | Meot-Ner (Mautner), 1983 | gas phase; Entropy change calculated or estimated; M |
By formula: C5H6N+ + C12H24O6 = (C5H6N+ • C12H24O6)
Bond type: Hydrogen bonds with polydentate bonding in positive ions
Quantity | Value | Units | Method | Reference | Comment |
---|---|---|---|---|---|
ΔrH° | 180. ± 20. | kJ/mol | PHPMS | Meot-Ner (Mautner), 1983 | gas phase; Entropy change calculated or estimated; M |
Quantity | Value | Units | Method | Reference | Comment |
ΔrS° | 180. | J/mol*K | N/A | Meot-Ner (Mautner), 1983 | gas phase; Entropy change calculated or estimated; M |
Free energy of reaction
ΔrG° (kJ/mol) | T (K) | Method | Reference | Comment |
---|---|---|---|---|
67. | 550. | PHPMS | Meot-Ner (Mautner), 1983 | gas phase; Entropy change calculated or estimated; M |
By formula: C6H14N+ + C12H24O6 = (C6H14N+ • C12H24O6)
Bond type: Hydrogen bonds with polydentate bonding in positive ions
Quantity | Value | Units | Method | Reference | Comment |
---|---|---|---|---|---|
ΔrH° | 200. ± 20. | kJ/mol | PHPMS | Meot-Ner (Mautner), 1983 | gas phase; Entropy change calculated or estimated; M |
Quantity | Value | Units | Method | Reference | Comment |
ΔrS° | 160. | J/mol*K | N/A | Meot-Ner (Mautner), 1983 | gas phase; Entropy change calculated or estimated; M |
Free energy of reaction
ΔrG° (kJ/mol) | T (K) | Method | Reference | Comment |
---|---|---|---|---|
96. | 670. | PHPMS | Meot-Ner (Mautner), 1983 | gas phase; Entropy change calculated or estimated; M |
By formula: C3H10N+ + C12H24O6 = (C3H10N+ • C12H24O6)
Bond type: Hydrogen bonds with polydentate bonding in positive ions
Quantity | Value | Units | Method | Reference | Comment |
---|---|---|---|---|---|
ΔrH° | 170. | kJ/mol | PHPMS | Meot-Ner (Mautner), 1983 | gas phase; Entropy change calculated or estimated; M |
Quantity | Value | Units | Method | Reference | Comment |
ΔrS° | 170. | J/mol*K | N/A | Meot-Ner (Mautner), 1983 | gas phase; Entropy change calculated or estimated; M |
Free energy of reaction
ΔrG° (kJ/mol) | T (K) | Method | Reference | Comment |
---|---|---|---|---|
75. | 569. | PHPMS | Meot-Ner (Mautner), 1983 | gas phase; Entropy change calculated or estimated; M |
By formula: Na+ + C12H24O6 = (Na+ • C12H24O6)
Quantity | Value | Units | Method | Reference | Comment |
---|---|---|---|---|---|
ΔrH° | 296. ± 19. | kJ/mol | CIDT | Rodgers and Armentrout, 2000 | RCD |
ΔrH° | 300. ± 19. | kJ/mol | CIDT | More, Ray, et al., 1999 | RCD |
Free energy of reaction
ΔrG° (kJ/mol) | T (K) | Method | Reference | Comment |
---|---|---|---|---|
0.0 | 0. | CIDT | Rodgers and Armentrout, 2000 | RCD |
0.0 | 298. | CIDT | More, Ray, et al., 1999 | RCD |
By formula: Cs+ + C12H24O6 = (Cs+ • C12H24O6)
Quantity | Value | Units | Method | Reference | Comment |
---|---|---|---|---|---|
ΔrH° | 168. ± 9.2 | kJ/mol | CIDT | Rodgers and Armentrout, 2000 | RCD |
By formula: Rb+ + C12H24O6 = (Rb+ • C12H24O6)
Quantity | Value | Units | Method | Reference | Comment |
---|---|---|---|---|---|
ΔrH° | 191. ± 13. | kJ/mol | CIDT | Rodgers and Armentrout, 2000 | RCD |
By formula: K+ + C12H24O6 = (K+ • C12H24O6)
Quantity | Value | Units | Method | Reference | Comment |
---|---|---|---|---|---|
ΔrH° | 235. ± 13. | kJ/mol | CIDT | Rodgers and Armentrout, 2000 | RCD |

Gas phase ion energetics data

Data evaluated as indicated in comments:
HL - Edward P. Hunter and Sharon G. Lias
Data compiled as indicated in comments:
LBLHLM - Sharon G. Lias, John E. Bartmess, Joel F. Liebman, John L. Holmes, Rhoda D. Levin, and W. Gary Mallard
LLK - Sharon G. Lias, Rhoda D. Levin, and Sherif A. Kafafi
Quantity | Value | Units | Method | Reference | Comment |
---|---|---|---|---|---|
Proton affinity (review) | 967.0 | kJ/mol | N/A | Hunter and Lias, 1998 | HL |
Quantity | Value | Units | Method | Reference | Comment |
Gas basicity | 909.5 | kJ/mol | N/A | Hunter and Lias, 1998 | HL |
Ionization energy determinations
IE (eV) | Method | Reference | Comment |
---|---|---|---|
8.9 | PE | Baker, Armen, et al., 1983 | LBLHLM |
9.7 | PE | Baker, Armen, et al., 1983 | Vertical value; LBLHLM |
9.70 | PE | Kajitani, Sugimori, et al., 1979 | Vertical value; LLK |

Ion clustering data

Data compiled as indicated in comments:
M - Michael M. Meot-Ner (Mautner) and Sharon G. Lias
RCD - Robert C. Dunbar
Clustering reactions
By formula: C3H10N+ + C12H24O6 = (C3H10N+ • C12H24O6)
Bond type: Hydrogen bonds with polydentate bonding in positive ions
Quantity | Value | Units | Method | Reference | Comment |
---|---|---|---|---|---|
ΔrH° | 170. | kJ/mol | PHPMS | Meot-Ner (Mautner), 1983 | gas phase; Entropy change calculated or estimated; M |
Quantity | Value | Units | Method | Reference | Comment |
ΔrS° | 170. | J/mol*K | N/A | Meot-Ner (Mautner), 1983 | gas phase; Entropy change calculated or estimated; M |
Free energy of reaction
ΔrG° (kJ/mol) | T (K) | Method | Reference | Comment |
---|---|---|---|---|
75. | 569. | PHPMS | Meot-Ner (Mautner), 1983 | gas phase; Entropy change calculated or estimated; M |
By formula: C4H5N2+ + C12H24O6 = (C4H5N2+ • C12H24O6)
Bond type: Hydrogen bonds with polydentate bonding in positive ions
Quantity | Value | Units | Method | Reference | Comment |
---|---|---|---|---|---|
ΔrH° | 180. ± 20. | kJ/mol | PHPMS | Meot-Ner (Mautner), 1983 | gas phase; Entropy change calculated or estimated; M |
Quantity | Value | Units | Method | Reference | Comment |
ΔrS° | 180. | J/mol*K | N/A | Meot-Ner (Mautner), 1983 | gas phase; Entropy change calculated or estimated; M |
Free energy of reaction
ΔrG° (kJ/mol) | T (K) | Method | Reference | Comment |
---|---|---|---|---|
67. | 600. | PHPMS | Meot-Ner (Mautner), 1983 | gas phase; Entropy change calculated or estimated; M |
By formula: C5H6N+ + C12H24O6 = (C5H6N+ • C12H24O6)
Bond type: Hydrogen bonds with polydentate bonding in positive ions
Quantity | Value | Units | Method | Reference | Comment |
---|---|---|---|---|---|
ΔrH° | 180. ± 20. | kJ/mol | PHPMS | Meot-Ner (Mautner), 1983 | gas phase; Entropy change calculated or estimated; M |
Quantity | Value | Units | Method | Reference | Comment |
ΔrS° | 180. | J/mol*K | N/A | Meot-Ner (Mautner), 1983 | gas phase; Entropy change calculated or estimated; M |
Free energy of reaction
ΔrG° (kJ/mol) | T (K) | Method | Reference | Comment |
---|---|---|---|---|
67. | 550. | PHPMS | Meot-Ner (Mautner), 1983 | gas phase; Entropy change calculated or estimated; M |
By formula: C6H14N+ + C12H24O6 = (C6H14N+ • C12H24O6)
Bond type: Hydrogen bonds with polydentate bonding in positive ions
Quantity | Value | Units | Method | Reference | Comment |
---|---|---|---|---|---|
ΔrH° | 200. ± 20. | kJ/mol | PHPMS | Meot-Ner (Mautner), 1983 | gas phase; Entropy change calculated or estimated; M |
Quantity | Value | Units | Method | Reference | Comment |
ΔrS° | 160. | J/mol*K | N/A | Meot-Ner (Mautner), 1983 | gas phase; Entropy change calculated or estimated; M |
Free energy of reaction
ΔrG° (kJ/mol) | T (K) | Method | Reference | Comment |
---|---|---|---|---|
96. | 670. | PHPMS | Meot-Ner (Mautner), 1983 | gas phase; Entropy change calculated or estimated; M |
By formula: Cs+ + C12H24O6 = (Cs+ • C12H24O6)
Quantity | Value | Units | Method | Reference | Comment |
---|---|---|---|---|---|
ΔrH° | 168. ± 9.2 | kJ/mol | CIDT | Rodgers and Armentrout, 2000 | RCD |
By formula: K+ + C12H24O6 = (K+ • C12H24O6)
Quantity | Value | Units | Method | Reference | Comment |
---|---|---|---|---|---|
ΔrH° | 235. ± 13. | kJ/mol | CIDT | Rodgers and Armentrout, 2000 | RCD |
By formula: Na+ + C12H24O6 = (Na+ • C12H24O6)
Quantity | Value | Units | Method | Reference | Comment |
---|---|---|---|---|---|
ΔrH° | 296. ± 19. | kJ/mol | CIDT | Rodgers and Armentrout, 2000 | RCD |
ΔrH° | 300. ± 19. | kJ/mol | CIDT | More, Ray, et al., 1999 | RCD |
Free energy of reaction
ΔrG° (kJ/mol) | T (K) | Method | Reference | Comment |
---|---|---|---|---|
0.0 | 0. | CIDT | Rodgers and Armentrout, 2000 | RCD |
0.0 | 298. | CIDT | More, Ray, et al., 1999 | RCD |
By formula: Rb+ + C12H24O6 = (Rb+ • C12H24O6)
Quantity | Value | Units | Method | Reference | Comment |
---|---|---|---|---|---|
ΔrH° | 191. ± 13. | kJ/mol | CIDT | Rodgers and Armentrout, 2000 | RCD |

Normal alkane RI, polar column, temperature ramp

Column type | Active phase | I | Reference | Comment |
---|---|---|---|---|
Capillary | DB-Wax | 2504. | Njoroge, Koaze, et al., 2005 | 60. m/0.25 mm/0.25 μm, N2, 70. C @ 2. min, 2. K/min, 230. C @ 20. min |

References

Moses and Larson, 1980
Moses, D.J.; Larson, J.W.,
Electrostatic ring strain in crown ethers,
Abstract of papers, 179th ACS National Meeting, Houston, TX, 1980, 984. [all data]
Vasil'ev, Borodin, et al., 1992
Vasil'ev, V.P.; Borodin, V.A.; Kopnyshev, S.B.,
Standard enthalpies of formation of certain crown-ethers,
Russ. J. Phys. Chem. (Engl. Transl.), 1992, 66, 585-587, In original 1104. [all data]
Dale and Kristiansen, 1972
Dale, J.; Kristiansen, P.O.,
Macrocyclic Oligo-ethers Related to Ethylene Oxide.,
Acta Chem. Scand., 1972, 26, 1471, https://doi.org/10.3891/acta.chem.scand.26-1471
. [all data]
Nichols, Orf, et al., 2000
Nichols, Gary; Orf, Jennifer; Reiter, Sarah M.; Chickos, James; Gokel, George W.,
The vaporization enthalpies of some crown and polyethers by correlation gas chromatography,
Thermochimica Acta, 2000, 346, 1-2, 15-28, https://doi.org/10.1016/S0040-6031(99)00405-0
. [all data]
PCR Inc., 1990
PCR Inc.,
Research Chemicals Catalog 1990-1991, PCR Inc., Gainesville, FL, 1990, 1. [all data]
Dale, Kristiansen, et al., 1972
Dale, Johannes; Kristiansen, Per Olav; Henriksen, Lars; Liaaen-Jensen, S.; Svensson, Sigfrid,
Macrocyclic Oligo-ethers Related to Ethylene Oxide.,
Acta Chem. Scand., 1972, 26, 1471-1478, https://doi.org/10.3891/acta.chem.scand.26-1471
. [all data]
Meot-Ner (Mautner), 1983
Meot-Ner (Mautner), M.,
The Ionic Hydrogen Bond. 3. Multiple and -CH+...O- Bonds. Complexes of Ammonium Ions with Polyethers and Crown Ethers,
J. Am. Chem. Soc., 1983, 105, 15, 4912, https://doi.org/10.1021/ja00353a012
. [all data]
Rodgers and Armentrout, 2000
Rodgers, M.T.; Armentrout, P.B.,
Noncovalent Metal-Ligand Bond Energies as Studied by Threshold Collision-Induced Dissociation,
Mass Spectrom. Rev., 2000, 19, 4, 215, https://doi.org/10.1002/1098-2787(200007)19:4<215::AID-MAS2>3.0.CO;2-X
. [all data]
More, Ray, et al., 1999
More, M.B.; Ray, D.; Armentrout, P.B.,
Intrinsic Affinities of Alkali Cations for 15-Crown-5 and 18-Crown-6: Bond Dissociation Energies of Gas-Phase M+-Crown Ether Complexes,
J. Am. Chem. Soc., 1999, 121, 2, 417, https://doi.org/10.1021/ja9823159
. [all data]
Hunter and Lias, 1998
Hunter, E.P.; Lias, S.G.,
Evaluated Gas Phase Basicities and Proton Affinities of Molecules: An Update,
J. Phys. Chem. Ref. Data, 1998, 27, 3, 413-656, https://doi.org/10.1063/1.556018
. [all data]
Baker, Armen, et al., 1983
Baker, A.D.; Armen, G.H.; Funaro, S.,
Oral levels of crown ethers and related macrocycles studies by ultraviolet photoelectron spectroscopy: Relationship to complexation studies,
J. Chem. Soc. Dalton Trans., 1983, 2519. [all data]
Kajitani, Sugimori, et al., 1979
Kajitani, M.; Sugimori, A.; Sato, N.; Seki, K.; Inokuchi, H.; Harada, Y.,
Ultraviolet photoelectron spectra of crown ethers,
Bull. Chem. Soc. Jpn., 1979, 52, 2199. [all data]
Njoroge, Koaze, et al., 2005
Njoroge, S.M.; Koaze, H.; Karanja, P.N.; Sawamura, M.,
Essential oil constituents of three varieties of Kenyan sweet oranges (Citrus sinensis),
Flavour Fragr. J., 2005, 20, 1, 80-85, https://doi.org/10.1002/ffj.1377
. [all data]