Hydrazine, 1,2-dibutyl-
- Formula: C8H20N2
- Molecular weight: 144.2578
- IUPAC Standard InChIKey: FEBRIAPYLGMZSR-UHFFFAOYSA-N
- CAS Registry Number: 1744-71-4
- Chemical structure:
View 3d structure (requires JavaScript / HTML 5) - Other names: 1,2-di-n-Butylhydrazine

Gas phase thermochemistry data

Data compiled by: Hussein Y. Afeefy, Joel F. Liebman, and Stephen E. Stein
Quantity | Value | Units | Method | Reference | Comment |
---|---|---|---|---|---|
ΔfH°gas | -59.4 | kJ/mol | Chyd | Engel, Owens, et al., 1993 |

Reaction thermochemistry data

Data compiled by: Hussein Y. Afeefy, Joel F. Liebman, and Stephen E. Stein
Individual Reactions
By formula: H2 + C8H18N2 = C8H20N2
Quantity | Value | Units | Method | Reference | Comment |
---|---|---|---|---|---|
ΔrH° | -68.6 ± 0.8 | kJ/mol | Chyd | Engel, Owens, et al., 1993 | liquid phase; solvent: Hexane |

Gas phase ion energetics data

Data compiled by: Sharon G. Lias, Rhoda D. Levin, and Sherif A. Kafafi
Ionization energy determinations
IE (eV) | Method | Reference | Comment |
---|---|---|---|
8.65 | PE | Rademacher, 1975 | Vertical value |

References

Engel, Owens, et al., 1993
Engel, P.S.; Owens, W.H.; Wang, C.,
The heat of oxidation of 1,2-di-n-butylhydrazine to azo-n-butane,
J. Phys. Chem., 1993, 97, 10486-10488. [all data]
Rademacher, 1975
Rademacher, P.,
Acyclische Hydrazine,
Chem. Ber., 1975, 108, 1548. [all data]