3,5,7-Nonatrien-1-yne, (E,E,E)-
- Formula: C9H10
- Molecular weight: 118.1757
- IUPAC Standard InChIKey: XDZLQHLDDCOFTD-SFYXYOTASA-N
- CAS Registry Number: 1743-34-6
- Chemical structure:
View 3d structure (requires JavaScript / HTML 5) - Permanent link for this species. Use this link for bookmarking this species for future reference.

Gas phase ion energetics data

Data compiled by: Sharon G. Lias, Rhoda D. Levin, and Sherif A. Kafafi
Ionization energy determinations
IE (eV) | Method | Reference |
---|---|---|
7.2 ± 0.1 | EI | Koppel, Schwarz, et al., 1974 |
Appearance energy determinations
Ion | AE (eV) | Other Products | Method | Reference | Comment |
---|---|---|---|---|---|
C9H9+ | 10.7 ± 0.1 | H | EI | Koppel, Schwarz, et al., 1974 |

References

Koppel, Schwarz, et al., 1974
Koppel, C.; Schwarz, H.; Bohlmann, F.,
Elektronenstossinduzierte fragmentierung von acetylenverbindungen. VIII. Struktur der stabilen und instabilen ionen[C9H9]+ aus isomeren C9H10- kohlenwasserstoffen,
Org. Mass Spectrom., 1974, 8, 25. [all data]