Methoxyacetonitrile
- Formula: C3H5NO
- Molecular weight: 71.0779
- IUPAC Standard InChIKey: QKPVEISEHYYHRH-UHFFFAOYSA-N
- CAS Registry Number: 1738-36-9
- Chemical structure:
View 3d structure (requires JavaScript / HTML 5) - Other names: NCCH2OCH3; Acetonitrile, methoxy-

Gas phase thermochemistry data

Data compiled by: Hussein Y. Afeefy, Joel F. Liebman, and Stephen E. Stein
Quantity | Value | Units | Method | Reference | Comment |
---|---|---|---|---|---|
ΔfH°gas | -35.65 ± 0.66 | kJ/mol | Ccb | Verevkin, Beckhaus, et al., 1995 | hf298_condensed[kJ/mol]=-77.36±0.21 |

Condensed phase thermochemistry data

Data compiled by: Hussein Y. Afeefy, Joel F. Liebman, and Stephen E. Stein
Quantity | Value | Units | Method | Reference | Comment |
---|---|---|---|---|---|
ΔfH°liquid | -77.36 ± 0.21 | kJ/mol | Ccb | Verevkin, Beckhaus, et al., 1995 | hf298_condensed[kJ/mol]=-77.36±0.21 |
Quantity | Value | Units | Method | Reference | Comment |
ΔcH°liquid | -1217.7 ± 0.17 | kJ/mol | Ccb | Verevkin, Beckhaus, et al., 1995 | hf298_condensed[kJ/mol]=-77.36±0.21 |

Phase change data

Data compiled as indicated in comments:
BS - Robert L. Brown and Stephen E. Stein
ALS - Hussein Y. Afeefy, Joel F. Liebman, and Stephen E. Stein
AC - William E. Acree, Jr., James S. Chickos
Quantity | Value | Units | Method | Reference | Comment |
---|---|---|---|---|---|
ΔvapH° | 41.71 ± 0.63 | kJ/mol | V | Verevkin, Beckhaus, et al., 1995 | hf298_condensed[kJ/mol]=-77.36±0.21; ALS |
ΔvapH° | 41.7 ± 0.6 | kJ/mol | GS | Verevkin, Beckhaus, et al., 1995 | Based on data from 285. to 316. K.; AC |
Reduced pressure boiling point
Tboil (K) | Pressure (bar) | Reference | Comment |
---|---|---|---|
391.3 | 0.975 | Weast and Grasselli, 1989 | BS |

Reaction thermochemistry data

Data compiled by: John E. Bartmess
Individual Reactions
C3H4NO- + =
By formula: C3H4NO- + H+ = C3H5NO
Quantity | Value | Units | Method | Reference | Comment |
---|---|---|---|---|---|
ΔrH° | 1556. ± 10. | kJ/mol | G+TS | Bartmess, Scott, et al., 1979 | gas phase; value altered from reference due to change in acidity scale |
Quantity | Value | Units | Method | Reference | Comment |
ΔrG° | 1524. ± 8.4 | kJ/mol | IMRE | Bartmess, Scott, et al., 1979 | gas phase; value altered from reference due to change in acidity scale |

Gas phase ion energetics data

Data evaluated as indicated in comments:
HL - Edward P. Hunter and Sharon G. Lias
Data compiled as indicated in comments:
B - John E. Bartmess
LBLHLM - Sharon G. Lias, John E. Bartmess, Joel F. Liebman, John L. Holmes, Rhoda D. Levin, and W. Gary Mallard
Quantity | Value | Units | Method | Reference | Comment |
---|---|---|---|---|---|
Proton affinity (review) | 758.1 | kJ/mol | N/A | Hunter and Lias, 1998 | HL |
Quantity | Value | Units | Method | Reference | Comment |
Gas basicity | 727.4 | kJ/mol | N/A | Hunter and Lias, 1998 | HL |
Ionization energy determinations
IE (eV) | Method | Reference | Comment |
---|---|---|---|
10.75 | PE | Molder, Pikver, et al., 1983 | LBLHLM |
De-protonation reactions
C3H4NO- + =
By formula: C3H4NO- + H+ = C3H5NO
Quantity | Value | Units | Method | Reference | Comment |
---|---|---|---|---|---|
ΔrH° | 1556. ± 10. | kJ/mol | G+TS | Bartmess, Scott, et al., 1979 | gas phase; value altered from reference due to change in acidity scale; B |
Quantity | Value | Units | Method | Reference | Comment |
ΔrG° | 1524. ± 8.4 | kJ/mol | IMRE | Bartmess, Scott, et al., 1979 | gas phase; value altered from reference due to change in acidity scale; B |

References

Verevkin, Beckhaus, et al., 1995
Verevkin, S.P.; Beckhaus, H.-D.; Ruchardt, C.,
Geminale substituenteneffekte. Teil 6. Standardbildungsenthalpien von alkylsubstituierten-alkoxynitrilen und α-cyano-carbonsaureestern,
Thermochim. Acta, 1995, 249, 1-11. [all data]
Weast and Grasselli, 1989
CRC Handbook of Data on Organic Compounds, 2nd Editon, Weast,R.C and Grasselli, J.G., ed(s)., CRC Press, Inc., Boca Raton, FL, 1989, 1. [all data]
Bartmess, Scott, et al., 1979
Bartmess, J.E.; Scott, J.A.; McIver, R.T., Jr.,
The gas phase acidity scale from methanol to phenol,
J. Am. Chem. Soc., 1979, 101, 6047. [all data]
Hunter and Lias, 1998
Hunter, E.P.; Lias, S.G.,
Evaluated Gas Phase Basicities and Proton Affinities of Molecules: An Update,
J. Phys. Chem. Ref. Data, 1998, 27, 3, 413-656, https://doi.org/10.1063/1.556018
. [all data]
Molder, Pikver, et al., 1983
Molder, U.H.; Pikver, R.J.; Koppel, I.A.,
Photoelectron spectra of molecules. 2. Ethers,
Org. React. (N.Y. Engl. Transl.), 1983, 20, 208. [all data]