Trimethyltin
- Formula: C3H9Sn
- Molecular weight: 163.814
- IUPAC Standard InChIKey: UKHQRARQNZOXRL-UHFFFAOYSA-N
- CAS Registry Number: 17272-57-0
- Chemical structure:
View 3d structure (requires JavaScript / HTML 5) - Permanent link for this species. Use this link for bookmarking this species for future reference.

Gas phase thermochemistry data

Data compiled by: José A. Martinho Simões
Quantity | Value | Units | Method | Reference | Comment |
---|---|---|---|---|---|
ΔfH°gas | 132. ± 17. | kJ/mol | Review | Martinho Simões | The enthalpy of formation relies on -17.7 ± 2.2 kJ/mol for the enthalpy of formation of Sn(Me)4(g). |
ΔfH°gas | 124. ± 8. | kJ/mol | Review | Martinho Simões | The enthalpy of formation relies on -17.7 ± 2.2 kJ/mol for the enthalpy of formation of Sn(Me)4(g). |

Reaction thermochemistry data

Data compiled by: José A. Martinho Simões
Individual Reactions
C3H10Sn (g) = (g) +
(g)
By formula: C3H10Sn (g) = H (g) + C3H9Sn (g)
Quantity | Value | Units | Method | Reference | Comment |
---|---|---|---|---|---|
ΔrH° | 312. ± 11. | kJ/mol | ICR | Brinkman, Salomon, et al., 1995 | The reaction enthalpy was derived from the acidity of Sn(Me)3(H)(g), 1460.2 ± 8.4 kJ/mol, the electron affinity of Sn(Me)3(g), 164.0 ± 6.3 kJ/mol Brinkman, Salomon, et al., 1995, and the ionization energy of H(g), 1312.0 kJ/mol Lias, Bartmess, et al., 1988. |
By formula: C4H12Sn (g) = C3H9Sn (g) + CH4 (g)
Quantity | Value | Units | Method | Reference | Comment |
---|---|---|---|---|---|
ΔrH° | 297. ± 17. | kJ/mol | N/A | McMillen and Golden, 1982 | |
ΔrH° | 289. ± 8. | kJ/mol | VLPP | Baldwin, Lewis, et al., 1979 | Please also see Smith and Patrick, 1983. |

Gas phase ion energetics data

Data compiled as indicated in comments:
RDSH - Henry M. Rosenstock, Keith Draxl, Bruce W. Steiner, and John T. Herron
B - John E. Bartmess
Electron affinity determinations
EA (eV) | Method | Reference | Comment |
---|---|---|---|
1.700 ± 0.065 | LPD | Brinkman, Salomon, et al., 1995 | B |
Ionization energy determinations
IE (eV) | Method | Reference | Comment |
---|---|---|---|
7.10 ± 0.05 | EI | Lampe and Niehaus, 1968 | RDSH |

References

Martinho Simões
Martinho Simões, J.A.,
Private communication (see http://webbook.nist.gov/chemistry/om/). [all data]
Brinkman, Salomon, et al., 1995
Brinkman, E.A.; Salomon, K.; Tumas, W.; Brauman, J.I.,
Electron affinities and gas-phase acidities of organogermanium and organotin compounds,
J. Am. Chem. Soc., 1995, 117, 17, 4905, https://doi.org/10.1021/ja00122a022
. [all data]
Lias, Bartmess, et al., 1988
Lias, S.G.; Bartmess, J.E.; Liebman, J.F.; Holmes, J.L.; Levin, R.D.; Mallard, W.G.,
Gas-Phase Ion and Neutral Thermochemistry, J. Phys. Chem. Ref. Data, 1988, 17, Suppl. 1. [all data]
McMillen and Golden, 1982
McMillen, D.F.; Golden, D.M.,
Hydrocarbon bond dissociation energies,
Ann. Rev. Phys. Chem., 1982, 33, 493. [all data]
Baldwin, Lewis, et al., 1979
Baldwin, A.C.; Lewis, K.E.; Golden, D.M.,
Int. J. Chem. Kinet., 1979, 11, 529. [all data]
Smith and Patrick, 1983
Smith, G.P.; Patrick, R.,
Int. J. Chem. Kinet., 1983, 15, 167. [all data]
Lampe and Niehaus, 1968
Lampe, F.W.; Niehaus, A.,
Ionization potentials of free radicals formed by electron impact. Methylstannyl radicals,
J. Chem. Phys., 1968, 49, 2949. [all data]