Propane-2-13c
- Formula: C15H8
- Molecular weight: 188.2240
- IUPAC Standard InChIKey: ATUOYWHBWRKTHZ-LBPDFUHNSA-N
- CAS Registry Number: 17251-62-6
- Chemical structure:
View 3d structure (requires JavaScript / HTML 5) - Isotopologues:

Gas phase ion energetics data

Data compiled by: Sharon G. Lias, John E. Bartmess, Joel F. Liebman, John L. Holmes, Rhoda D. Levin, and W. Gary Mallard
Appearance energy determinations
Ion | AE (eV) | Other Products | Method | Reference | Comment |
---|---|---|---|---|---|
C2H4+ | 11.69 ± 0.05 | CH4 | PIPECO | Gilman, Hsieh, et al., 1982 | |
C2H4+ | 11.91 ± 0.03 | <13>CH4 | PIPECO | Gilman, Hsieh, et al., 1982 |

References

Gilman, Hsieh, et al., 1982
Gilman, J.P.; Hsieh, T.; Meisels, G.G.,
Carbon skeletal rearrangement of the propane ion,
J. Chem. Phys., 1982, 76, 3497. [all data]