Thiophene, 2,3,5-trichloro-
- Formula: C4HCl3S
- Molecular weight: 187.475
- IUPAC Standard InChIKey: AZIFHMYTYFPVMV-UHFFFAOYSA-N
- CAS Registry Number: 17249-77-3
- Chemical structure:
View 3d structure (requires JavaScript / HTML 5) - Permanent link for this species. Use this link for bookmarking this species for future reference.

Gas phase ion energetics data

Data compiled by: Sharon G. Lias and Joel F. Liebman
Ionization energy determinations
IE (eV) | Method | Reference |
---|---|---|
8.71 | PE | Veszpremi, Nyulaszi, et al., 1988 |

Phase change data

Data compiled by: Robert L. Brown and Stephen E. Stein
Quantity | Value | Units | Method | Reference | Comment |
---|---|---|---|---|---|
Tboil | 471.9 | K | N/A | Weast and Grasselli, 1989 |

References

Veszpremi, Nyulaszi, et al., 1988
Veszpremi, T.; Nyulaszi, L.; Zsombok, G.Y.,
Systematic hel UPS study of chlorothiophenes,
J. Electron Spectrosc. Relat. Phenom., 1988, 46, 269. [all data]