Thiophene, 3,4-dichloro-
- Formula: C4H2Cl2S
- Molecular weight: 153.030
- IUPAC Standard InChIKey: QVFXSOFIEKYPOE-UHFFFAOYSA-N
- CAS Registry Number: 17249-76-2
- Chemical structure:
View 3d structure (requires JavaScript / HTML 5) - Permanent link for this species. Use this link for bookmarking this species for future reference.

Gas phase ion energetics data

Data compiled by: Sharon G. Lias and Joel F. Liebman
Ionization energy determinations
IE (eV) | Method | Reference |
---|---|---|
9.05 | PE | Veszpremi, Nyulaszi, et al., 1988 |

Phase change data

Data compiled by: Robert L. Brown and Stephen E. Stein
Quantity | Value | Units | Method | Reference | Comment |
---|---|---|---|---|---|
Tboil | 458.2 | K | N/A | Weast and Grasselli, 1989 |

References

Veszpremi, Nyulaszi, et al., 1988
Veszpremi, T.; Nyulaszi, L.; Zsombok, G.Y.,
Systematic hel UPS study of chlorothiophenes,
J. Electron Spectrosc. Relat. Phenom., 1988, 46, 269. [all data]