Cyclododecanol
- Formula: C12H24O
- Molecular weight: 184.3184
- IUPAC Standard InChIKey: SFVWPXMPRCIVOK-UHFFFAOYSA-N
- CAS Registry Number: 1724-39-6
- Chemical structure:
View 3d structure (requires JavaScript / HTML 5) - Permanent link for this species. Use this link for bookmarking this species for future reference.

Phase change data

Data compiled by: William E. Acree, Jr., James S. Chickos
Enthalpy of vaporization
ΔvapH (kJ/mol) | Temperature (K) | Method | Reference | Comment |
---|---|---|---|---|
68.8 | 420. | A | Stephenson and Malanowski, 1987 | Based on data from 405. to 468. K. |
57.1 | 482. | A | Stephenson and Malanowski, 1987 | Based on data from 467. to 557. K. |

Gas phase ion energetics data

Data compiled as indicated in comments:
LLK - Sharon G. Lias, Rhoda D. Levin, and Sherif A. Kafafi
Ionization energy determinations
IE (eV) | Method | Reference | Comment |
---|---|---|---|
9.26 ± 0.03 | PI | Golubitskii, Kulikov, et al., 1979 | LLK |

Kovats' RI, non-polar column, isothermal

Column type | Active phase | Temperature (C) | I | Reference | Comment |
---|---|---|---|---|---|
Capillary | OV-1 | 150. | 1544.2 | Rudenko and Rudenko, 2005 | He; Column diameter: 0.25 mm |
Capillary | OV-1 | 170. | 1555.9 | Rudenko and Rudenko, 2005 | He; Column diameter: 0.25 mm |
Capillary | OV-1 | 190. | 1575.6 | Rudenko and Rudenko, 2005 | He; Column diameter: 0.25 mm |
Capillary | OV-1 | 150. | 1544.2 | Rudenko and Rudenko, 2000 | He; Column diameter: 0.25 mm |
Capillary | OV-1 | 170. | 1555.9 | Rudenko and Rudenko, 2000 | He; Column diameter: 0.25 mm |
Capillary | OV-1 | 190. | 1575.6 | Rudenko and Rudenko, 2000 | He; Column diameter: 0.25 mm |

Kovats' RI, polar column, isothermal

Column type | Active phase | Temperature (C) | I | Reference | Comment |
---|---|---|---|---|---|
Capillary | Carbowax 40M | 150. | 2103.8 | Rudenko and Rudenko, 2005 | He; Column diameter: 0.25 mm |
Capillary | Carbowax 40M | 170. | 2123.3 | Rudenko and Rudenko, 2005 | He; Column diameter: 0.25 mm |
Capillary | Carbowax 40M | 190. | 2152.4 | Rudenko and Rudenko, 2005 | He; Column diameter: 0.25 mm |
Capillary | Carbowax 40M | 150. | 2103.8 | Rudenko and Rudenko, 2000 | He; Column diameter: 0.25 mm |
Capillary | Carbowax 40M | 170. | 2123.3 | Rudenko and Rudenko, 2000 | He; Column diameter: 0.25 mm |
Capillary | Carbowax 40M | 190. | 2152.4 | Rudenko and Rudenko, 2000 | He; Column diameter: 0.25 mm |

References

Stephenson and Malanowski, 1987
Stephenson, Richard M.; Malanowski, Stanislaw,
Handbook of the Thermodynamics of Organic Compounds, 1987, https://doi.org/10.1007/978-94-009-3173-2
. [all data]
Golubitskii, Kulikov, et al., 1979
Golubitskii, A.E.; Kulikov, N.S.; Zyakun, A.M.; Valovoi, V.A.; Alekseev, A.M.; Volkov, V.N.,
Photoionization mass spectra of alicyclic compounds with various substituents, and their ionization energies and appearance energies,
Bull. Acad. Sci. USSR, Div. Chem. Sci., 1979, 11, 2602. [all data]
Rudenko and Rudenko, 2005
Rudenko, B.A.; Rudenko, G.I.,
Gas chromatography with open tubular columns of cyclododecane derivatives,
J. Anal. Chem. USSR (Engl. Transl.), 2005, 60, 4, 345-348. [all data]
Rudenko and Rudenko, 2000
Rudenko, B.A.; Rudenko, G.I.,
Capillary chromatography of cyclododecane derivatives, Proceedings, 23rd ISCC; CD-ROM, 2000, retrieved from http://www.richrom.com/assets/CD23PDF. [all data]