Methylamine borane(3)
- Formula: CH8BN
- Molecular weight: 44.892
- CAS Registry Number: 1722-33-4

Phase change data

Data compiled by: William E. Acree, Jr., James S. Chickos
Enthalpy of sublimation
ΔsubH (kcal/mol) | Temperature (K) | Method | Reference |
---|---|---|---|
18.8 ± 1.0 | 273. to 318. | ME | Alton, Brown, et al., 1959 |

Gas phase ion energetics data

Data compiled as indicated in comments:
LLK - Sharon G. Lias, Rhoda D. Levin, and Sherif A. Kafafi
Ionization energy determinations
IE (eV) | Method | Reference | Comment |
---|---|---|---|
9.66 ± 0.01 | PE | Lloyd and Lynaugh, 1972 | LLK |

References

Alton, Brown, et al., 1959
Alton, E.R.; Brown, R.D.; Carter, J.C.; Taylor, R.C.,
Vapor Pressures of the Methylamine-Boranes and Ammonia-Triborane 1,
J. Am. Chem. Soc., 1959, 81, 14, 3550-3551, https://doi.org/10.1021/ja01523a016
. [all data]
Lloyd and Lynaugh, 1972
Lloyd, D.R.; Lynaugh, N.,
Photoelectron studies of boron compounds. Part 3. Complexes of borane with Lewis bases,
J. Chem. Soc. Faraday Trans. 2, 1972, 68, 947. [all data]