Benzene, 1,1'-(1,3,5-hexatriene-1,6-diyl)bis-
- Formula: C18H16
- Molecular weight: 232.3196
- IUPAC Standard InChIKey: BOBLSBAZCVBABY-WPWUJOAOSA-N
- CAS Registry Number: 1720-32-7
- Chemical structure:
View 3d structure (requires JavaScript / HTML 5) - Species with the same structure:
- Other names: 1,3,5-Hexatriene, 1,6-diphenyl-; Diphenylhexatriene; 1,6-Diphenyl-1,3,5-hexatriene; 1,6-Diphenylhexatriene; a,w-Diphenylhexatriene; Dph; Dph (dye); Dicinnamyl; (6-Phenyl-1,3,5-hexatrienyl)benzene; 1,6-diphenylhexa-1,3,5-triene

Phase change data

Data compiled by: Thermodynamics Research Center, NIST Boulder Laboratories, Chris Muzny director
Quantity | Value | Units | Method | Reference | Comment |
---|---|---|---|---|---|
Tfus | 475.2 | K | N/A | Sangster and Irvine, 1956 | Uncertainty assigned by TRC = 4. K |

Gas phase ion energetics data

Data compiled as indicated in comments:
LLK - Sharon G. Lias, Rhoda D. Levin, and Sherif A. Kafafi
RDSH - Henry M. Rosenstock, Keith Draxl, Bruce W. Steiner, and John T. Herron
B - John E. Bartmess
Electron affinity determinations
EA (eV) | Method | Reference | Comment |
---|---|---|---|
0.890 ± 0.020 | LPES | Siegert, Vogeler, et al., 2011 | B |
Ionization energy determinations
IE (eV) | Method | Reference | Comment |
---|---|---|---|
7.6 | CTS | Briegleb and Czekalla, 1959 | RDSH |
7.27 ± 0.03 | PE | Klessinger and Gunkel, 1978 | Vertical value; LLK |
7.33 | PE | Hudson, Ridyard, et al., 1976 | Vertical value; LLK |

References

Sangster and Irvine, 1956
Sangster, R.C.; Irvine, J.W.,
Study of Organic Scintillators,
J. Chem. Phys., 1956, 24, 670. [all data]
Siegert, Vogeler, et al., 2011
Siegert, S.; Vogeler, F.; Marian, C.M.; Weinkauf, R.,
Throwing light on dark states of alpha-oligothiophenes of chain lengths 2 to 6: radical anion photoelectron spectroscopy and excited-state theory,
Phys. Chem. Chem. Phys., 2011, 13, 21, 10350-10363, https://doi.org/10.1039/c0cp02712j
. [all data]
Briegleb and Czekalla, 1959
Briegleb, G.; Czekalla, J.,
Die Bestimmung von lonisierungsenergien aus den Spektren von Elektronenubergangskomplexen,
Z.Elektrochem., 1959, 63, 6. [all data]
Klessinger and Gunkel, 1978
Klessinger, M.; Gunkel, E.,
The electronic structure of polyenes and unsaturated carbonyl compounds,
Tetrahedron, 1978, 34, 3591. [all data]
Hudson, Ridyard, et al., 1976
Hudson, B.S.; Ridyard, J.N.A.; Diamond, J.,
Polyene spectroscopy. Photoelectron spectra of the diphenylpolyenes,
J. Am. Chem. Soc., 1976, 98, 1126. [all data]
Dahne and Schob., 1973
Dahne, S.; Schob., F.,
J. prakt. Chem., 1973, 315, 810. [all data]