2,4-Azetidinedione,3,3-bis(1-methylethyl)-
- Formula: C9H15NO2
- Molecular weight: 169.2209
- IUPAC Standard InChIKey: YOZRHJBSUAWCNU-UHFFFAOYSA-N
- CAS Registry Number: 17197-62-5
- Chemical structure:
View 3d structure (requires JavaScript / HTML 5) - Permanent link for this species. Use this link for bookmarking this species for future reference.

Gas phase ion energetics data

Data compiled by: Sharon G. Lias, Rhoda D. Levin, and Sherif A. Kafafi
Ionization energy determinations
IE (eV) | Method | Reference |
---|---|---|
9.42 | EI | Compernolle and DeSchryver, 1975 |
Appearance energy determinations
Ion | AE (eV) | Other Products | Method | Reference | Comment |
---|---|---|---|---|---|
C8H14O+ | 9.49 | HN=C=O | EI | Compernolle and DeSchryver, 1975 |

References

Compernolle and DeSchryver, 1975
Compernolle, F.; DeSchryver, F.,
Nonconcerted cycloreversion by electron impact of substituted 2,4-azetidinediones. Relations between the mass spectral and photochemical reactions,
J. Am. Chem. Soc., 1975, 97, 3909. [all data]