Bicyclo[2.2.1]hept-2-ene, 2-methoxy-
- Formula: C8H12O
- Molecular weight: 124.1803
- IUPAC Standard InChIKey: QISDNYRVIVJFSJ-UHFFFAOYSA-N
- CAS Registry Number: 17190-90-8
- Chemical structure:
View 3d structure (requires JavaScript / HTML 5) - Permanent link for this species. Use this link for bookmarking this species for future reference.

Gas phase ion energetics data

Data compiled as indicated in comments:
LBLHLM - Sharon G. Lias, John E. Bartmess, Joel F. Liebman, John L. Holmes, Rhoda D. Levin, and W. Gary Mallard
Ionization energy determinations
IE (eV) | Method | Reference | Comment |
---|---|---|---|
8.15 | PE | Houk, Rondan, et al., 1983 | Vertical value; LBLHLM |

References

Houk, Rondan, et al., 1983
Houk, K.N.; Rondan, N.G.; Paddon-Row, M.N.; Jefford, C.W.; Huy, P.T.; Burrow, P.D.; Jordan, K.D.,
Ionization potentials, electron affinities, and molecular orbitals of 2-substituted norbornadienes. Theory of 1,2 and homo-1,4 carbene cycloaddition selectivities,
J. Am. Chem. Soc., 1983, 105, 5563. [all data]