1H-1-Silaindene, 2,3-dihydro-1,1-dimethyl-
- Formula: C10H14Si
- Molecular weight: 162.3037
- IUPAC Standard InChIKey: MNIXUONHKSJMFL-UHFFFAOYSA-N
- CAS Registry Number: 17158-48-4
- Chemical structure:
View 3d structure (requires JavaScript / HTML 5) - Other names: 1-Silaindan, 1,1-dimethyl-

Gas phase ion energetics data

Data compiled by: Henry M. Rosenstock, Keith Draxl, Bruce W. Steiner, and John T. Herron
Ionization energy determinations
IE (eV) | Method | Reference |
---|---|---|
8.54 | CTS | Pitt, 1970 |

References

Pitt, 1970
Pitt, C.G.,
Hyperconjugation: An alternative to the concept of the pπ-dπ bond in Group IV chemistry,
J. Organomet. Chem., 1970, 23, 35. [all data]