Ether, 2,4,6-cycloheptatrien-1-yl methyl
- Formula: C8H10O
- Molecular weight: 122.1644
- IUPAC Standard InChIKey: RUJLQZXBIZHGNF-UHFFFAOYSA-N
- CAS Registry Number: 1714-38-1
- Chemical structure:
View 3d structure (requires JavaScript / HTML 5) - Other names: 1,3,5-Cycloheptatriene, 7-methoxy-; 7-Methoxy-1,3,5-cycloheptatriene; 7-Methoxycycloheptatriene; 7-Methoxycyclohepta-1,3,5-triene

Gas phase ion energetics data

Data compiled as indicated in comments:
LLK - Sharon G. Lias, Rhoda D. Levin, and Sherif A. Kafafi
RDSH - Henry M. Rosenstock, Keith Draxl, Bruce W. Steiner, and John T. Herron
Ionization energy determinations
IE (eV) | Method | Reference | Comment |
---|---|---|---|
7.23 | EI | Hoffman and Bursey, 1971 | LLK |
Appearance energy determinations
Ion | AE (eV) | Other Products | Method | Reference | Comment |
---|---|---|---|---|---|
C6H7+ | 11.1 | ? | EI | Harrison, Haynes, et al., 1965 | RDSH |
C7H7+ | 11.23 | ? | EI | Hoffman and Bursey, 1971 | LLK |
C7H7O+ | 10.26 | CH3 | EI | Hoffman and Bursey, 1971 | LLK |
C8H9O+ | 9.7 ± 0.1 | H | EI | Meyer and Harrison, 1964 | RDSH |

References

Hoffman and Bursey, 1971
Hoffman, M.K.; Bursey, M.M.,
Structural characteristics of non-decomposing C7H7+ ions from some methyl ethers on electron impact,
Chem. Commun., 1971, 824. [all data]
Harrison, Haynes, et al., 1965
Harrison, A.G.; Haynes, P.; McLean, S.; Meyer, F.,
The mass spectra of methyl-substituted cyclopentadienes,
J. Am. Chem. Soc., 1965, 87, 5099. [all data]
Meyer and Harrison, 1964
Meyer, F.; Harrison, A.G.,
An electron impact study of methyl phenyl ethers,
Can. J. Chem., 1964, 42, 2008. [all data]