Benzoyl chloride, 4-(1,1-dimethylethyl)-
- Formula: C11H13ClO
- Molecular weight: 196.673
- IUPAC Standard InChIKey: WNLMYNASWOULQY-UHFFFAOYSA-N
- CAS Registry Number: 1710-98-1
- Chemical structure:
View 3d structure (requires JavaScript / HTML 5) - Other names: 4-tert-Butylbenzoyl chloride; p-tert-Butylbenzoyl chloride

Phase change data

Data compiled by: Robert L. Brown and Stephen E. Stein
Reduced pressure boiling point
Tboil (K) | Pressure (bar) | Reference |
---|---|---|
408.2 | 0.027 | Weast and Grasselli, 1989 |

Gas phase ion energetics data

Data compiled as indicated in comments:
LL - Sharon G. Lias and Joel F. Liebman
RDSH - Henry M. Rosenstock, Keith Draxl, Bruce W. Steiner, and John T. Herron
Ionization energy determinations
IE (eV) | Method | Reference | Comment |
---|---|---|---|
9.14 | PI | Takhistov, Misharev, et al., 1995 | LL |
Appearance energy determinations
Ion | AE (eV) | Other Products | Method | Reference | Comment |
---|---|---|---|---|---|
CH3+ | 14.9 | ? | EI | Fraser and Paul, 1968 | RDSH |
C10H10ClO+ | 9.49 | CH3 | PI | Takhistov, Misharev, et al., 1995 | LL |
C11H13O+[(CH3)3CC6H4CO+] | 9.42 | Cl | PI | Takhistov, Misharev, et al., 1995 | LL |
NO2+ | 11.8 | C3H7O | EI | Fraser and Paul, 1968 | RDSH |

Van Den Dool and Kratz RI, non-polar column, custom temperature program

Column type | Active phase | I | Reference | Comment |
---|---|---|---|---|
Capillary | VF-5MS | 1112. | Tretyakov, 2011 | 30. m/0.25 mm/0.25 μm, He; Program: Multi-step temperature program; T(initial)=60C; T(final)=270C |

References

Weast and Grasselli, 1989
CRC Handbook of Data on Organic Compounds, 2nd Editon, Weast,R.C and Grasselli, J.G., ed(s)., CRC Press, Inc., Boca Raton, FL, 1989, 1. [all data]
Takhistov, Misharev, et al., 1995
Takhistov, V.V.; Misharev, A.D.; Orlov, V.M.; Ponomarev, D.A.; Voss, J.,
Thermochemistry and mass spectrometry of aromatic compounds with tertiary alkyl groups,
Eur. Mass Spectrom., 1995, 1, 353. [all data]
Fraser and Paul, 1968
Fraser, R.T.M.; Paul, N.C.,
The mass spectrometry of nitrate esters and related compounds. Part I,
J. Chem. Soc. B, 1968, 659. [all data]
Tretyakov, 2011
Tretyakov, K.V.,
Retention Data. NIST Mass Spectrometry Data Center., NIST Mass Spectrometry Data Center, 2011. [all data]