Cyclopropane, 1,1-diethenyl-
- Formula: C7H10
- Molecular weight: 94.1543
- IUPAC Standard InChIKey: UDKCHWVGPNQSQK-UHFFFAOYSA-N
- CAS Registry Number: 17085-84-6
- Chemical structure:
View 3d structure (requires JavaScript / HTML 5) - Permanent link for this species. Use this link for bookmarking this species for future reference.

Gas phase thermochemistry data

Data compiled by: Hussein Y. Afeefy, Joel F. Liebman, and Stephen E. Stein
Quantity | Value | Units | Method | Reference | Comment |
---|---|---|---|---|---|
ΔfH°gas | 202. | kJ/mol | Chyd | Roth, Adamczak, et al., 1991 |

Reaction thermochemistry data

Data compiled by: Hussein Y. Afeefy, Joel F. Liebman, and Stephen E. Stein
Individual Reactions
By formula: 3H2 + C7H10 = C7H16
Quantity | Value | Units | Method | Reference | Comment |
---|---|---|---|---|---|
ΔrH° | -391. ± 0.8 | kJ/mol | Chyd | Roth, Adamczak, et al., 1991 | liquid phase |

Gas phase ion energetics data

Data compiled by: Sharon G. Lias and Joel F. Liebman
Ionization energy determinations
IE (eV) | Method | Reference | Comment |
---|---|---|---|
8.5 | PE | Eckert-Maksie, Gleiter, et al., 1991 | |
8.98 | PE | Eckert-Maksie, Gleiter, et al., 1991 | Vertical value |

References

Roth, Adamczak, et al., 1991
Roth, W.R.; Adamczak, O.; Breuckmann, R.; Lennartz, H.-W.; Boese, R.,
Die Berechnung von Resonanzenergien; das MM2ERW-Kraftfeld,
Chem. Ber., 1991, 124, 2499-2521. [all data]
Eckert-Maksie, Gleiter, et al., 1991
Eckert-Maksie, M.; Gleiter, R.; Zefirov, N.S.; Kozhushkov, S.I.; Kuznetsova, T.S.,
Photoelectron spectra of geminal vinyl- and ethynyl-disubstituted cyclopropane derivatives,
Chem. Ber., 1991, 124, 371. [all data]