Thiophene, 2,5-dihydro-
- Formula: C4H6S
- Molecular weight: 86.155
- IUPAC Standard InChIKey: WURYWHAKEJHAOV-UHFFFAOYSA-N
- CAS Registry Number: 1708-32-3
- Chemical structure:
View 3d structure (requires JavaScript / HTML 5) - Other names: 2,5-Dihydrothiophene

Gas phase thermochemistry data

Data compiled by: Hussein Y. Afeefy, Joel F. Liebman, and Stephen E. Stein
Quantity | Value | Units | Method | Reference | Comment |
---|---|---|---|---|---|
ΔfH°gas | 87.3 ± 1.2 | kJ/mol | Ccr | Davies and Sunner, 1962 |

Condensed phase thermochemistry data

Data compiled by: Hussein Y. Afeefy, Joel F. Liebman, and Stephen E. Stein
Quantity | Value | Units | Method | Reference | Comment |
---|---|---|---|---|---|
ΔfH°liquid | 47.3 ± 1.2 | kJ/mol | Ccr | Davies and Sunner, 1962 | |
Quantity | Value | Units | Method | Reference | Comment |
ΔcH°liquid | -3081.1 ± 1.0 | kJ/mol | Ccr | Davies and Sunner, 1962 |

Phase change data

Data compiled as indicated in comments:
TRC - Thermodynamics Research Center, NIST Boulder Laboratories, Chris Muzny director
ALS - Hussein Y. Afeefy, Joel F. Liebman, and Stephen E. Stein
DRB - Donald R. Burgess, Jr.
Quantity | Value | Units | Method | Reference | Comment |
---|---|---|---|---|---|
Tboil | 395.5 | K | N/A | Majer and Svoboda, 1985 | |
Tboil | 395.45 | K | N/A | Davies and Sunner, 1962, 2 | Uncertainty assigned by TRC = 0.5 K; TRC |
Quantity | Value | Units | Method | Reference | Comment |
Tfus | 223.85 | K | N/A | Davies and Sunner, 1962, 2 | Uncertainty assigned by TRC = 1.5 K; TRC |
Tfus | 223.05 | K | N/A | Davies and Sunner, 1962, 2 | Uncertainty assigned by TRC = 1. K; TRC |
Quantity | Value | Units | Method | Reference | Comment |
ΔvapH° | 39.97 | kJ/mol | N/A | Majer and Svoboda, 1985 | |
ΔvapH° | 40.0 ± 0.3 | kJ/mol | C | Davies and Sunner, 1962 | ALS |
ΔvapH° | 40.0 | kJ/mol | N/A | Davies and Sunner, 1962 | DRB |
Enthalpy of vaporization
ΔvapH (kJ/mol) | Temperature (K) | Reference |
---|---|---|
34.83 | 395.5 | Majer and Svoboda, 1985 |

Gas phase ion energetics data

Data compiled by: Sharon G. Lias, Rhoda D. Levin, and Sherif A. Kafafi
Ionization energy determinations
IE (eV) | Method | Reference | Comment |
---|---|---|---|
8.4 | PE | Schmidt and Schweig, 1973 | |
8.54 | PE | Schmidt and Schweig, 1973 | Vertical value |

References

Davies and Sunner, 1962
Davies, J.V.; Sunner, S.,
Heats of combustion and formation of thiolane and of the thiolenes,
Acta Chem. Scand., 1962, 16, 1870-1876. [all data]
Majer and Svoboda, 1985
Majer, V.; Svoboda, V.,
Enthalpies of Vaporization of Organic Compounds: A Critical Review and Data Compilation, Blackwell Scientific Publications, Oxford, 1985, 300. [all data]
Davies and Sunner, 1962, 2
Davies, J.V.; Sunner, S.,
Heats of Combustion and Formation of Thiolane and the Thiolenes,
Acta Chem. Scand., 1962, 16, 1870. [all data]
Schmidt and Schweig, 1973
Schmidt, H.; Schweig, A.,
Ausschluss transanularer Wechselwirkung in 2.5-Dihydrothiophen,
Tetrahedron Lett., 1973, 1437. [all data]