Furan, 2,5-dihydro-
- Formula: C4H6O
- Molecular weight: 70.0898
- IUPAC Standard InChIKey: ARGCQEVBJHPOGB-UHFFFAOYSA-N
- CAS Registry Number: 1708-29-8
- Chemical structure:
View 3d structure (requires JavaScript / HTML 5) - Other names: 2,5-Dihydrofuran; 1-Oxa-3-cyclopentene; 3-Oxolene

Gas phase thermochemistry data

Data compiled by: Glushko Thermocenter, Russian Academy of Sciences, Moscow
Constant pressure heat capacity of gas
Cp,gas (J/mol*K) | Temperature (K) | Reference | Comment |
---|---|---|---|
51.31 | 200. | Klots T.D., 1994 | Recommended entropies and heat capacities agree with previous statistically calculated values [ Chao J., 1986, Dorofeeva O.V., 1992] within 1-3.5 J/mol*K. |
73.21 ± 0.11 | 298.15 | ||
73.68 | 300. | ||
99.17 | 400. | ||
121.86 | 500. | ||
140.66 | 600. | ||
156.12 | 700. | ||
168.98 | 800. | ||
179.78 | 900. | ||
188.91 | 1000. |

Phase change data

Data compiled as indicated in comments:
BS - Robert L. Brown and Stephen E. Stein
TRC - Thermodynamics Research Center, NIST Boulder Laboratories, Chris Muzny director
Quantity | Value | Units | Method | Reference | Comment |
---|---|---|---|---|---|
Tboil | 339.7 | K | N/A | Aldrich Chemical Company Inc., 1990 | BS |
Tboil | 337.4 | K | N/A | Ueda and Shimanouchi, 1967 | Uncertainty assigned by TRC = 1.5 K; TRC |
Tboil | 339.65 | K | N/A | Strohmeyer, 1965 | Uncertainty assigned by TRC = 3. K; TRC |
Tboil | 340.15 | K | N/A | Kimura, 1955 | Uncertainty assigned by TRC = 2. K; TRC |

Reaction thermochemistry data

Data compiled by: Hussein Y. Afeefy, Joel F. Liebman, and Stephen E. Stein
Individual Reactions
By formula: H2 + C4H6O = C4H8O
Quantity | Value | Units | Method | Reference | Comment |
---|---|---|---|---|---|
ΔrH° | -117.1 ± 1.3 | kJ/mol | Chyd | Allinger, Glaser, et al., 1981 | liquid phase; solvent: Hexane |

Gas phase ion energetics data

Data evaluated as indicated in comments:
HL - Edward P. Hunter and Sharon G. Lias
Data compiled as indicated in comments:
LLK - Sharon G. Lias, Rhoda D. Levin, and Sherif A. Kafafi
Quantity | Value | Units | Method | Reference | Comment |
---|---|---|---|---|---|
Proton affinity (review) | 823.4 | kJ/mol | N/A | Hunter and Lias, 1998 | HL |
Quantity | Value | Units | Method | Reference | Comment |
Gas basicity | 796. | kJ/mol | N/A | Hunter and Lias, 1998 | HL |
Ionization energy determinations
IE (eV) | Method | Reference | Comment |
---|---|---|---|
9.16 | PE | Schmidt, Schweig, et al., 1976 | Vertical value; LLK |
9.16 | PE | Schmidt and Schweig, 1974 | Vertical value; LLK |
9.14 ± 0.02 | PE | Bain, Bunzli, et al., 1973 | Vertical value; LLK |

References

Klots T.D., 1994
Klots T.D.,
Vibrational assignment and analysis for 2,3-dihydrofuran and 2,5-dihydrofuran,
Spectrochim. Acta, 1994, A50, 1725-1748. [all data]
Chao J., 1986
Chao J.,
Thermodynamic properties of key organic oxygen compounds in the carbon range C1 to C4. Part 2. Ideal gas properties,
J. Phys. Chem. Ref. Data, 1986, 15, 1369-1436. [all data]
Dorofeeva O.V., 1992
Dorofeeva O.V.,
Ideal gas thermodynamic properties of oxygen heterocyclic compounds. Part 1. Three-membered, four-membered and five-membered rings,
Thermochim. Acta, 1992, 194, 9-46. [all data]
Aldrich Chemical Company Inc., 1990
Aldrich Chemical Company Inc.,
Catalog Handbook of Fine Chemicals, Aldrich Chemical Company, Inc., Milwaukee WI, 1990, 1. [all data]
Ueda and Shimanouchi, 1967
Ueda, T.; Shimanouchi, T.,
Ring-Puckering Motion of 1,5-Dihydrofuran,
J. Chem. Phys., 1967, 47, 4042. [all data]
Strohmeyer, 1965
Strohmeyer, M.,
, 1965. [all data]
Kimura, 1955
Kimura, R.,
Yakugaku Zasshi, 1955, 75, 1175. [all data]
Allinger, Glaser, et al., 1981
Allinger, N.L.; Glaser, J.A.; Davis, H.E.,
Heats of hydrogenation of some vinyl ethers and related compounds,
J. Org. Chem., 1981, 46, 658-661. [all data]
Hunter and Lias, 1998
Hunter, E.P.; Lias, S.G.,
Evaluated Gas Phase Basicities and Proton Affinities of Molecules: An Update,
J. Phys. Chem. Ref. Data, 1998, 27, 3, 413-656, https://doi.org/10.1063/1.556018
. [all data]
Schmidt, Schweig, et al., 1976
Schmidt, H.; Schweig, A.; Anastassiou, A.G.; Wetzel, J.C.,
The dominant role of hyperconjugation in the 9-oxabicyclo[4.2.1]nona-2,4,7-triene series,
Tetrahedron, 1976, 32, 2239. [all data]
Schmidt and Schweig, 1974
Schmidt, H.; Schweig, A.,
Notiz zur transanularen n/π-Wechselwirkung in 2,5-Dihydrofuran,
Chem. Ber., 1974, 107, 725. [all data]
Bain, Bunzli, et al., 1973
Bain, A.D.; Bunzli, J.C.; Frost, D.C.; Weiler, L.,
Photoelectron spectra of cyclic ethers,
J. Am. Chem. Soc., 1973, 95, 291. [all data]