Propane, 1,3-dimethoxy-
- Formula: C5H12O2
- Molecular weight: 104.1476
- IUPAC Standard InChIKey: UUAMLBIYJDPGFU-UHFFFAOYSA-N
- CAS Registry Number: 17081-21-9
- Chemical structure:
View 3d structure (requires JavaScript / HTML 5) - Other names: Trimethylene glycol dimethyl ether; 1,3-Dimethoxypropane; CH3O(CH2)3OCH3

Reaction thermochemistry data

Data compiled by: Michael M. Meot-Ner (Mautner) and Sharon G. Lias
Individual Reactions
By formula: CH6N+ + C5H12O2 = (CH6N+ • C5H12O2)
Bond type: Hydrogen bonds with polydentate bonding in positive ions
Quantity | Value | Units | Method | Reference | Comment |
---|---|---|---|---|---|
ΔrH° | 131. | kJ/mol | PHPMS | Meot-Ner, 1984 | gas phase |
ΔrH° | 131. | kJ/mol | PHPMS | Meot-Ner (Mautner), 1983 | gas phase |
Quantity | Value | Units | Method | Reference | Comment |
ΔrS° | 134. | J/mol*K | PHPMS | Meot-Ner, 1984 | gas phase |
ΔrS° | 134. | J/mol*K | PHPMS | Meot-Ner (Mautner), 1983 | gas phase |
By formula: C3H10N+ + C5H12O2 = (C3H10N+ • C5H12O2)
Bond type: Hydrogen bonds with polydentate bonding in positive ions
Quantity | Value | Units | Method | Reference | Comment |
---|---|---|---|---|---|
ΔrH° | 107. | kJ/mol | PHPMS | Meot-Ner (Mautner), 1983 | gas phase |
Quantity | Value | Units | Method | Reference | Comment |
ΔrS° | 138. | J/mol*K | PHPMS | Meot-Ner (Mautner), 1983 | gas phase |
By formula: C5H5FN+ + C5H12O2 = (C5H5FN+ • C5H12O2)
Bond type: Hydrogen bonds with polydentate bonding in positive ions
Quantity | Value | Units | Method | Reference | Comment |
---|---|---|---|---|---|
ΔrH° | 110. | kJ/mol | PHPMS | Meot-Ner (Mautner), 1983 | gas phase |
Quantity | Value | Units | Method | Reference | Comment |
ΔrS° | 132. | J/mol*K | PHPMS | Meot-Ner (Mautner), 1983 | gas phase |
By formula: C5H6N+ + C5H12O2 = (C5H6N+ • C5H12O2)
Bond type: Hydrogen bonds with polydentate bonding in positive ions
Quantity | Value | Units | Method | Reference | Comment |
---|---|---|---|---|---|
ΔrH° | 111. | kJ/mol | PHPMS | Meot-Ner (Mautner), 1983 | gas phase |
Quantity | Value | Units | Method | Reference | Comment |
ΔrS° | 150. | J/mol*K | PHPMS | Meot-Ner (Mautner), 1983 | gas phase |
By formula: C6H14N+ + C5H12O2 = (C6H14N+ • C5H12O2)
Bond type: Hydrogen bonds with polydentate bonding in positive ions
Quantity | Value | Units | Method | Reference | Comment |
---|---|---|---|---|---|
ΔrH° | 119. | kJ/mol | PHPMS | Meot-Ner (Mautner), 1983 | gas phase |
Quantity | Value | Units | Method | Reference | Comment |
ΔrS° | 146. | J/mol*K | PHPMS | Meot-Ner (Mautner), 1983 | gas phase |

Gas phase ion energetics data

Data evaluated as indicated in comments:
HL - Edward P. Hunter and Sharon G. Lias
Data compiled as indicated in comments:
LBLHLM - Sharon G. Lias, John E. Bartmess, Joel F. Liebman, John L. Holmes, Rhoda D. Levin, and W. Gary Mallard
Quantity | Value | Units | Method | Reference | Comment |
---|---|---|---|---|---|
Proton affinity (review) | 897.2 | kJ/mol | N/A | Hunter and Lias, 1998 | HL |
Quantity | Value | Units | Method | Reference | Comment |
Gas basicity | 858.6 | kJ/mol | N/A | Hunter and Lias, 1998 | HL |
Ionization energy determinations
IE (eV) | Method | Reference | Comment |
---|---|---|---|
9.3 | PE | Biermann and Morton, 1983 | LBLHLM |
9.68 | PE | Biermann and Morton, 1983 | Vertical value; LBLHLM |

Ion clustering data

Data compiled by: Michael M. Meot-Ner (Mautner) and Sharon G. Lias
Clustering reactions
By formula: CH6N+ + C5H12O2 = (CH6N+ • C5H12O2)
Bond type: Hydrogen bonds with polydentate bonding in positive ions
Quantity | Value | Units | Method | Reference | Comment |
---|---|---|---|---|---|
ΔrH° | 131. | kJ/mol | PHPMS | Meot-Ner, 1984 | gas phase |
ΔrH° | 131. | kJ/mol | PHPMS | Meot-Ner (Mautner), 1983 | gas phase |
Quantity | Value | Units | Method | Reference | Comment |
ΔrS° | 134. | J/mol*K | PHPMS | Meot-Ner, 1984 | gas phase |
ΔrS° | 134. | J/mol*K | PHPMS | Meot-Ner (Mautner), 1983 | gas phase |
By formula: C3H10N+ + C5H12O2 = (C3H10N+ • C5H12O2)
Bond type: Hydrogen bonds with polydentate bonding in positive ions
Quantity | Value | Units | Method | Reference | Comment |
---|---|---|---|---|---|
ΔrH° | 107. | kJ/mol | PHPMS | Meot-Ner (Mautner), 1983 | gas phase |
Quantity | Value | Units | Method | Reference | Comment |
ΔrS° | 138. | J/mol*K | PHPMS | Meot-Ner (Mautner), 1983 | gas phase |
By formula: C5H5FN+ + C5H12O2 = (C5H5FN+ • C5H12O2)
Bond type: Hydrogen bonds with polydentate bonding in positive ions
Quantity | Value | Units | Method | Reference | Comment |
---|---|---|---|---|---|
ΔrH° | 110. | kJ/mol | PHPMS | Meot-Ner (Mautner), 1983 | gas phase |
Quantity | Value | Units | Method | Reference | Comment |
ΔrS° | 132. | J/mol*K | PHPMS | Meot-Ner (Mautner), 1983 | gas phase |
By formula: C5H6N+ + C5H12O2 = (C5H6N+ • C5H12O2)
Bond type: Hydrogen bonds with polydentate bonding in positive ions
Quantity | Value | Units | Method | Reference | Comment |
---|---|---|---|---|---|
ΔrH° | 111. | kJ/mol | PHPMS | Meot-Ner (Mautner), 1983 | gas phase |
Quantity | Value | Units | Method | Reference | Comment |
ΔrS° | 150. | J/mol*K | PHPMS | Meot-Ner (Mautner), 1983 | gas phase |
By formula: C6H14N+ + C5H12O2 = (C6H14N+ • C5H12O2)
Bond type: Hydrogen bonds with polydentate bonding in positive ions
Quantity | Value | Units | Method | Reference | Comment |
---|---|---|---|---|---|
ΔrH° | 119. | kJ/mol | PHPMS | Meot-Ner (Mautner), 1983 | gas phase |
Quantity | Value | Units | Method | Reference | Comment |
ΔrS° | 146. | J/mol*K | PHPMS | Meot-Ner (Mautner), 1983 | gas phase |

Normal alkane RI, non-polar column, custom temperature program

Column type | Active phase | I | Reference | Comment |
---|---|---|---|---|
Packed | Apiezon L | 697.3 | Keiko, Prokop'ev, et al., 1972 | Program: not specified |
Packed | Squalane | 700.0 | Keiko, Prokop'ev, et al., 1972 | Program: not specified |

References

Meot-Ner, 1984
Meot-Ner, (Mautner)M.,
The Ionic Hydrogen Bond and Ion Solvation. 1. -NH+ O-, -NH+ N- and -OH+ O- Bonds. Correlations with Proton Affinity. Deviations Due to Structural Effects,
J. Am. Chem. Soc., 1984, 106, 5, 1257, https://doi.org/10.1021/ja00317a015
. [all data]
Meot-Ner (Mautner), 1983
Meot-Ner (Mautner), M.,
The Ionic Hydrogen Bond. 3. Multiple and -CH+...O- Bonds. Complexes of Ammonium Ions with Polyethers and Crown Ethers,
J. Am. Chem. Soc., 1983, 105, 15, 4912, https://doi.org/10.1021/ja00353a012
. [all data]
Hunter and Lias, 1998
Hunter, E.P.; Lias, S.G.,
Evaluated Gas Phase Basicities and Proton Affinities of Molecules: An Update,
J. Phys. Chem. Ref. Data, 1998, 27, 3, 413-656, https://doi.org/10.1063/1.556018
. [all data]
Biermann and Morton, 1983
Biermann, H.W.; Morton, T.H.,
Reversible tautomerization of radical cations. Photoionization of 2-methoxyethanol and 3-methoxy-1-propanol,
J. Am. Chem. Soc., 1983, 105, 5025. [all data]
Keiko, Prokop'ev, et al., 1972
Keiko, V.V.; Prokop'ev, B.V.; Kuz'menko, L.P.; Kalinina, N.A.; Modonov, V.B.,
The use of an additive scheme of calculation of the indices of retention in gas-liquid chromatography communication. 3. Some regularities in the manifestation of the inductive effect,
Izv. Akad. Nauk Kaz. SSR Ser. Khim., 1972, 12, 2629-2633. [all data]