1,2:3,4-Dicyclooctenobenzene
- Formula: C18H26
- Molecular weight: 242.3990
- IUPAC Standard InChIKey: IRATWOHAZBNERN-UHFFFAOYSA-N
- CAS Registry Number: 17044-68-7
- Chemical structure:
View 3d structure (requires JavaScript / HTML 5) - Permanent link for this species. Use this link for bookmarking this species for future reference.

Gas phase ion energetics data

Data compiled by: Henry M. Rosenstock, Keith Draxl, Bruce W. Steiner, and John T. Herron
Ionization energy determinations
IE (eV) | Method | Reference |
---|---|---|
7.93 ± 0.03 | EI | Meier, Heiss, et al., 1968 |

References

Meier, Heiss, et al., 1968
Meier, H.; Heiss, J.; Suhr, H.; Muller, E.,
Energetische Untersuchungen zum Mills-Nixon-Effekt. Ionisierungsenergien von Benzolmolekulen mit ankondensierten gesattigten Ringen,
Tetrahedron, 1968, 24, 2307. [all data]