Pyrimidine-1-oxide
- Formula: C4H4N2O
- Molecular weight: 96.0874
- IUPAC Standard InChIKey: OQZGLXOADHKTDN-UHFFFAOYSA-N
- CAS Registry Number: 17043-94-6
- Chemical structure:
View 3d structure (requires JavaScript / HTML 5) - Permanent link for this species. Use this link for bookmarking this species for future reference.

Gas phase ion energetics data

Data compiled as indicated in comments:
LLK - Sharon G. Lias, Rhoda D. Levin, and Sherif A. Kafafi
Ionization energy determinations
IE (eV) | Method | Reference | Comment |
---|---|---|---|
8.80 ± 0.02 | PE | Maier, Muller, et al., 1975 | LLK |

References

Maier, Muller, et al., 1975
Maier, J.P.; Muller, J.-F.; Kubota, T.,
182. Ionisation energies and the electronic structures of the N-oxides of diazabenzenes,
Helv. Chim. Acta, 1975, 58, 1634. [all data]