Formyl cation
- Formula: CHO+
- Molecular weight: 29.0175
- IUPAC Standard InChIKey: XPRMKTHGXOVKEH-UHFFFAOYSA-N
- CAS Registry Number: 17030-74-9
- Chemical structure:
View 3d structure (requires JavaScript / HTML 5) - Other names: Formyl, unipositive ion; Methylium, oxo-; HCO; HCO+

Reaction thermochemistry data

Data compiled by: Michael M. Meot-Ner (Mautner) and Sharon G. Lias
Individual Reactions
By formula: CHO+ + CO = (CHO+ • CO)
Quantity | Value | Units | Method | Reference | Comment |
---|---|---|---|---|---|
ΔrH° | 45.2 | kJ/mol | PHPMS | Jennings, Headley, et al., 1982 | gas phase |
ΔrH° | 53.6 | kJ/mol | PHPMS | Hiraoka, Saluja, et al., 1979 | gas phase |
ΔrH° | 49.0 | kJ/mol | PHPMS | Meot-Ner (Mautner) and Field, 1974 | gas phase |
Quantity | Value | Units | Method | Reference | Comment |
ΔrS° | 94.1 | J/mol*K | PHPMS | Jennings, Headley, et al., 1982 | gas phase |
ΔrS° | 100. | J/mol*K | PHPMS | Hiraoka, Saluja, et al., 1979 | gas phase |
ΔrS° | 87.4 | J/mol*K | PHPMS | Meot-Ner (Mautner) and Field, 1974 | gas phase |
By formula: (CHO+ • 2CO) + CO = (CHO+ • 3CO)
Quantity | Value | Units | Method | Reference | Comment |
---|---|---|---|---|---|
ΔrH° | 19. ± 1. | kJ/mol | PHPMS | Hiraoka and Mori, 1989 | gas phase |
ΔrH° | 26. | kJ/mol | PHPMS | Hiraoka, Saluja, et al., 1979 | gas phase |
Quantity | Value | Units | Method | Reference | Comment |
ΔrS° | 66.1 | J/mol*K | PHPMS | Hiraoka and Mori, 1989 | gas phase |
ΔrS° | 110. | J/mol*K | PHPMS | Hiraoka, Saluja, et al., 1979 | gas phase |
By formula: (CHO+ • 3CO) + CO = (CHO+ • 4CO)
Quantity | Value | Units | Method | Reference | Comment |
---|---|---|---|---|---|
ΔrH° | 19. ± 1. | kJ/mol | PHPMS | Hiraoka and Mori, 1989 | gas phase |
ΔrH° | 26. | kJ/mol | PHPMS | Hiraoka, Saluja, et al., 1979 | gas phase |
Quantity | Value | Units | Method | Reference | Comment |
ΔrS° | 76.1 | J/mol*K | PHPMS | Hiraoka and Mori, 1989 | gas phase |
ΔrS° | 120. | J/mol*K | PHPMS | Hiraoka, Saluja, et al., 1979 | gas phase |
By formula: (CHO+ • 4CO) + CO = (CHO+ • 5CO)
Quantity | Value | Units | Method | Reference | Comment |
---|---|---|---|---|---|
ΔrH° | 18. ± 1. | kJ/mol | PHPMS | Hiraoka and Mori, 1989 | gas phase |
ΔrH° | 24. | kJ/mol | PHPMS | Hiraoka, Saluja, et al., 1979 | gas phase |
Quantity | Value | Units | Method | Reference | Comment |
ΔrS° | 95.8 | J/mol*K | PHPMS | Hiraoka and Mori, 1989 | gas phase |
ΔrS° | 130. | J/mol*K | PHPMS | Hiraoka, Saluja, et al., 1979 | gas phase |
By formula: (CHO+ • CO) + CO = (CHO+ • 2CO)
Quantity | Value | Units | Method | Reference | Comment |
---|---|---|---|---|---|
ΔrH° | 20. ± 1. | kJ/mol | PHPMS | Hiraoka and Mori, 1989 | gas phase |
ΔrH° | 28. | kJ/mol | PHPMS | Hiraoka, Saluja, et al., 1979 | gas phase |
Quantity | Value | Units | Method | Reference | Comment |
ΔrS° | 62.8 | J/mol*K | PHPMS | Hiraoka and Mori, 1989 | gas phase |
ΔrS° | 100. | J/mol*K | PHPMS | Hiraoka, Saluja, et al., 1979 | gas phase |
By formula: (CHO+ • 14CO) + CO = (CHO+ • 15CO)
Quantity | Value | Units | Method | Reference | Comment |
---|---|---|---|---|---|
ΔrH° | 7.36 | kJ/mol | PHPMS | Hiraoka and Mori, 1989 | gas phase; Entropy change calculated or estimated |
Quantity | Value | Units | Method | Reference | Comment |
ΔrS° | 96. | J/mol*K | N/A | Hiraoka and Mori, 1989 | gas phase; Entropy change calculated or estimated |
By formula: (CHO+ • 3CO2) + CO2 = (CHO+ • 4CO2)
Quantity | Value | Units | Method | Reference | Comment |
---|---|---|---|---|---|
ΔrH° | 35. | kJ/mol | PHPMS | Hiraoka, Shoda, et al., 1986 | gas phase; Entropy change calculated or estimated |
Quantity | Value | Units | Method | Reference | Comment |
ΔrS° | 100. | J/mol*K | N/A | Hiraoka, Shoda, et al., 1986 | gas phase; Entropy change calculated or estimated |
By formula: (CHO+ • 10CO) + CO = (CHO+ • 11CO)
Quantity | Value | Units | Method | Reference | Comment |
---|---|---|---|---|---|
ΔrH° | 8. ± 1. | kJ/mol | PHPMS | Hiraoka and Mori, 1989 | gas phase |
Quantity | Value | Units | Method | Reference | Comment |
ΔrS° | 96.2 | J/mol*K | PHPMS | Hiraoka and Mori, 1989 | gas phase |
By formula: (CHO+ • 11CO) + CO = (CHO+ • 12CO)
Quantity | Value | Units | Method | Reference | Comment |
---|---|---|---|---|---|
ΔrH° | 8. ± 1. | kJ/mol | PHPMS | Hiraoka and Mori, 1989 | gas phase |
Quantity | Value | Units | Method | Reference | Comment |
ΔrS° | 97.1 | J/mol*K | PHPMS | Hiraoka and Mori, 1989 | gas phase |
By formula: (CHO+ • 12CO) + CO = (CHO+ • 13CO)
Quantity | Value | Units | Method | Reference | Comment |
---|---|---|---|---|---|
ΔrH° | 8. ± 1. | kJ/mol | PHPMS | Hiraoka and Mori, 1989 | gas phase |
Quantity | Value | Units | Method | Reference | Comment |
ΔrS° | 97.1 | J/mol*K | PHPMS | Hiraoka and Mori, 1989 | gas phase |
By formula: (CHO+ • 13CO) + CO = (CHO+ • 14CO)
Quantity | Value | Units | Method | Reference | Comment |
---|---|---|---|---|---|
ΔrH° | 7. ± 1. | kJ/mol | PHPMS | Hiraoka and Mori, 1989 | gas phase |
Quantity | Value | Units | Method | Reference | Comment |
ΔrS° | 96.7 | J/mol*K | PHPMS | Hiraoka and Mori, 1989 | gas phase |
By formula: (CHO+ • 9CO) + CO = (CHO+ • 10CO)
Quantity | Value | Units | Method | Reference | Comment |
---|---|---|---|---|---|
ΔrH° | 8. ± 1. | kJ/mol | PHPMS | Hiraoka and Mori, 1989 | gas phase |
Quantity | Value | Units | Method | Reference | Comment |
ΔrS° | 93.3 | J/mol*K | PHPMS | Hiraoka and Mori, 1989 | gas phase |
By formula: (CHO+ • 5CO) + CO = (CHO+ • 6CO)
Quantity | Value | Units | Method | Reference | Comment |
---|---|---|---|---|---|
ΔrH° | 10. ± 1. | kJ/mol | PHPMS | Hiraoka and Mori, 1989 | gas phase |
Quantity | Value | Units | Method | Reference | Comment |
ΔrS° | 79.5 | J/mol*K | PHPMS | Hiraoka and Mori, 1989 | gas phase |
By formula: (CHO+ • 6CO) + CO = (CHO+ • 7CO)
Quantity | Value | Units | Method | Reference | Comment |
---|---|---|---|---|---|
ΔrH° | 9. ± 1. | kJ/mol | PHPMS | Hiraoka and Mori, 1989 | gas phase |
Quantity | Value | Units | Method | Reference | Comment |
ΔrS° | 88.3 | J/mol*K | PHPMS | Hiraoka and Mori, 1989 | gas phase |
By formula: (CHO+ • 7CO) + CO = (CHO+ • 8CO)
Quantity | Value | Units | Method | Reference | Comment |
---|---|---|---|---|---|
ΔrH° | 9. ± 1. | kJ/mol | PHPMS | Hiraoka and Mori, 1989 | gas phase |
Quantity | Value | Units | Method | Reference | Comment |
ΔrS° | 92.0 | J/mol*K | PHPMS | Hiraoka and Mori, 1989 | gas phase |
By formula: (CHO+ • 8CO) + CO = (CHO+ • 9CO)
Quantity | Value | Units | Method | Reference | Comment |
---|---|---|---|---|---|
ΔrH° | 9. ± 1. | kJ/mol | PHPMS | Hiraoka and Mori, 1989 | gas phase |
Quantity | Value | Units | Method | Reference | Comment |
ΔrS° | 94.6 | J/mol*K | PHPMS | Hiraoka and Mori, 1989 | gas phase |
By formula: (CHO+ • 2CO2) + CO2 = (CHO+ • 3CO2)
Quantity | Value | Units | Method | Reference | Comment |
---|---|---|---|---|---|
ΔrH° | 29. | kJ/mol | PHPMS | Hiraoka, Shoda, et al., 1986 | gas phase |
Quantity | Value | Units | Method | Reference | Comment |
ΔrS° | 95.0 | J/mol*K | PHPMS | Hiraoka, Shoda, et al., 1986 | gas phase |
By formula: (CHO+ • CO2) + CO2 = (CHO+ • 2CO2)
Quantity | Value | Units | Method | Reference | Comment |
---|---|---|---|---|---|
ΔrH° | 30. | kJ/mol | PHPMS | Hiraoka, Shoda, et al., 1986 | gas phase |
Quantity | Value | Units | Method | Reference | Comment |
ΔrS° | 82.4 | J/mol*K | PHPMS | Hiraoka, Shoda, et al., 1986 | gas phase |
By formula: CHO+ + H2 = (CHO+ • H2)
Quantity | Value | Units | Method | Reference | Comment |
---|---|---|---|---|---|
ΔrH° | 16. | kJ/mol | PHPMS | Hiraoka and Kebarle, 1975 | gas phase |
Quantity | Value | Units | Method | Reference | Comment |
ΔrS° | 85.8 | J/mol*K | PHPMS | Hiraoka and Kebarle, 1975 | gas phase |
By formula: CHO+ + CO2 = (CHO+ • CO2)
Quantity | Value | Units | Method | Reference | Comment |
---|---|---|---|---|---|
ΔrH° | 52.7 | kJ/mol | PHPMS | Hiraoka, Shoda, et al., 1986 | gas phase |
Quantity | Value | Units | Method | Reference | Comment |
ΔrS° | 89.5 | J/mol*K | PHPMS | Hiraoka, Shoda, et al., 1986 | gas phase |

Vibrational and/or electronic energy levels

Data compiled by: Marilyn E. Jacox
State: X
Vib. sym. |
No. | Approximate type of mode |
cm-1 | Med. | Method | References | |
---|---|---|---|---|---|---|---|
Σ+ | 1 | CH stretch | 3088.74 | gas | LD CC | Gudeman, Begemann, et al., 1983 Amano, 1983 Owrutsky, Keim, et al., 1989 Keim, Polak, et al., 1990 | |
1 | CH stretch | 3076.31 | H | gas | PF | Nizkorodov, Maier, et al., 1995 | |
1 | CH stretch | 3046.12 | gas | PF | Nizkorodov, Dopfer, et al., 1996 | ||
1 | CH stretch | 2815.06 | A | gas | PF | Nizkorodov, Dopfer, et al., 1995 | |
1 | CH stretch | 2840 | H | gas | PF | Bieske, Nizkorodov, et al., 1995 | |
Π | 2 | Bend | 829.72 | gas | DL MPI | Davies and Rothwell, 1984 Kawaguchi, Yamada, et al., 1985 Foltynowicz, Robinson, et al., 2000 | |
Σ+ | 3 | CO stretch | 2183.95 | gas | DL | Foster, McKellar, et al., 1984 Davies, Hamilton, et al., 1984 Liu, Lee, et al., 1988 | |
3 | CO stretch | 2135.71 | A | gas | DL | Linnartz, Speck, et al., 1998 | |
Additional references: Jacox, 1994, page 37; Jacox, 1998, page 145; Jacox, 2003, page 33; Dyke, Jonathan, et al., 1980; Bogey, Demuynck, et al., 1981; Sastry, Herbst, et al., 1981; Woods, Saykally, et al., 1981; Foster and McKellar, 1984; Kawaguchi, McKellar, et al., 1986; Dyke, 1987; Woods, 1988; Ohshima, Sumiyoshi, et al., 1997; Olkhov, Nizkorodov, et al., 1997; Foltynowicz, Robinson, et al., 2001; Foltynowicz, Robinson, et al., 2001, 2; Dore, Beninati, et al., 2003

Ion clustering data

Data compiled by: Michael M. Meot-Ner (Mautner) and Sharon G. Lias
Clustering reactions
By formula: CHO+ + CO = (CHO+ • CO)
Quantity | Value | Units | Method | Reference | Comment |
---|---|---|---|---|---|
ΔrH° | 10.8 | kcal/mol | PHPMS | Jennings, Headley, et al., 1982 | gas phase |
ΔrH° | 12.8 | kcal/mol | PHPMS | Hiraoka, Saluja, et al., 1979 | gas phase |
ΔrH° | 11.7 | kcal/mol | PHPMS | Meot-Ner (Mautner) and Field, 1974 | gas phase |
Quantity | Value | Units | Method | Reference | Comment |
ΔrS° | 22.5 | cal/mol*K | PHPMS | Jennings, Headley, et al., 1982 | gas phase |
ΔrS° | 24. | cal/mol*K | PHPMS | Hiraoka, Saluja, et al., 1979 | gas phase |
ΔrS° | 20.9 | cal/mol*K | PHPMS | Meot-Ner (Mautner) and Field, 1974 | gas phase |
By formula: (CHO+ • CO) + CO = (CHO+ • 2CO)
Quantity | Value | Units | Method | Reference | Comment |
---|---|---|---|---|---|
ΔrH° | 4.9 ± 0.3 | kcal/mol | PHPMS | Hiraoka and Mori, 1989 | gas phase |
ΔrH° | 6.6 | kcal/mol | PHPMS | Hiraoka, Saluja, et al., 1979 | gas phase |
Quantity | Value | Units | Method | Reference | Comment |
ΔrS° | 15.0 | cal/mol*K | PHPMS | Hiraoka and Mori, 1989 | gas phase |
ΔrS° | 24. | cal/mol*K | PHPMS | Hiraoka, Saluja, et al., 1979 | gas phase |
By formula: (CHO+ • 2CO) + CO = (CHO+ • 3CO)
Quantity | Value | Units | Method | Reference | Comment |
---|---|---|---|---|---|
ΔrH° | 4.7 ± 0.3 | kcal/mol | PHPMS | Hiraoka and Mori, 1989 | gas phase |
ΔrH° | 6.3 | kcal/mol | PHPMS | Hiraoka, Saluja, et al., 1979 | gas phase |
Quantity | Value | Units | Method | Reference | Comment |
ΔrS° | 15.8 | cal/mol*K | PHPMS | Hiraoka and Mori, 1989 | gas phase |
ΔrS° | 26. | cal/mol*K | PHPMS | Hiraoka, Saluja, et al., 1979 | gas phase |
By formula: (CHO+ • 3CO) + CO = (CHO+ • 4CO)
Quantity | Value | Units | Method | Reference | Comment |
---|---|---|---|---|---|
ΔrH° | 4.5 ± 0.3 | kcal/mol | PHPMS | Hiraoka and Mori, 1989 | gas phase |
ΔrH° | 6.2 | kcal/mol | PHPMS | Hiraoka, Saluja, et al., 1979 | gas phase |
Quantity | Value | Units | Method | Reference | Comment |
ΔrS° | 18.2 | cal/mol*K | PHPMS | Hiraoka and Mori, 1989 | gas phase |
ΔrS° | 29. | cal/mol*K | PHPMS | Hiraoka, Saluja, et al., 1979 | gas phase |
By formula: (CHO+ • 4CO) + CO = (CHO+ • 5CO)
Quantity | Value | Units | Method | Reference | Comment |
---|---|---|---|---|---|
ΔrH° | 4.2 ± 0.3 | kcal/mol | PHPMS | Hiraoka and Mori, 1989 | gas phase |
ΔrH° | 5.8 | kcal/mol | PHPMS | Hiraoka, Saluja, et al., 1979 | gas phase |
Quantity | Value | Units | Method | Reference | Comment |
ΔrS° | 22.9 | cal/mol*K | PHPMS | Hiraoka and Mori, 1989 | gas phase |
ΔrS° | 32. | cal/mol*K | PHPMS | Hiraoka, Saluja, et al., 1979 | gas phase |
By formula: (CHO+ • 5CO) + CO = (CHO+ • 6CO)
Quantity | Value | Units | Method | Reference | Comment |
---|---|---|---|---|---|
ΔrH° | 2.4 ± 0.3 | kcal/mol | PHPMS | Hiraoka and Mori, 1989 | gas phase |
Quantity | Value | Units | Method | Reference | Comment |
ΔrS° | 19.0 | cal/mol*K | PHPMS | Hiraoka and Mori, 1989 | gas phase |
By formula: (CHO+ • 6CO) + CO = (CHO+ • 7CO)
Quantity | Value | Units | Method | Reference | Comment |
---|---|---|---|---|---|
ΔrH° | 2.3 ± 0.3 | kcal/mol | PHPMS | Hiraoka and Mori, 1989 | gas phase |
Quantity | Value | Units | Method | Reference | Comment |
ΔrS° | 21.1 | cal/mol*K | PHPMS | Hiraoka and Mori, 1989 | gas phase |
By formula: (CHO+ • 7CO) + CO = (CHO+ • 8CO)
Quantity | Value | Units | Method | Reference | Comment |
---|---|---|---|---|---|
ΔrH° | 2.2 ± 0.3 | kcal/mol | PHPMS | Hiraoka and Mori, 1989 | gas phase |
Quantity | Value | Units | Method | Reference | Comment |
ΔrS° | 22.0 | cal/mol*K | PHPMS | Hiraoka and Mori, 1989 | gas phase |
By formula: (CHO+ • 8CO) + CO = (CHO+ • 9CO)
Quantity | Value | Units | Method | Reference | Comment |
---|---|---|---|---|---|
ΔrH° | 2.1 ± 0.3 | kcal/mol | PHPMS | Hiraoka and Mori, 1989 | gas phase |
Quantity | Value | Units | Method | Reference | Comment |
ΔrS° | 22.6 | cal/mol*K | PHPMS | Hiraoka and Mori, 1989 | gas phase |
By formula: (CHO+ • 9CO) + CO = (CHO+ • 10CO)
Quantity | Value | Units | Method | Reference | Comment |
---|---|---|---|---|---|
ΔrH° | 2.0 ± 0.3 | kcal/mol | PHPMS | Hiraoka and Mori, 1989 | gas phase |
Quantity | Value | Units | Method | Reference | Comment |
ΔrS° | 22.3 | cal/mol*K | PHPMS | Hiraoka and Mori, 1989 | gas phase |
By formula: (CHO+ • 10CO) + CO = (CHO+ • 11CO)
Quantity | Value | Units | Method | Reference | Comment |
---|---|---|---|---|---|
ΔrH° | 2.0 ± 0.3 | kcal/mol | PHPMS | Hiraoka and Mori, 1989 | gas phase |
Quantity | Value | Units | Method | Reference | Comment |
ΔrS° | 23.0 | cal/mol*K | PHPMS | Hiraoka and Mori, 1989 | gas phase |
By formula: (CHO+ • 11CO) + CO = (CHO+ • 12CO)
Quantity | Value | Units | Method | Reference | Comment |
---|---|---|---|---|---|
ΔrH° | 1.9 ± 0.3 | kcal/mol | PHPMS | Hiraoka and Mori, 1989 | gas phase |
Quantity | Value | Units | Method | Reference | Comment |
ΔrS° | 23.2 | cal/mol*K | PHPMS | Hiraoka and Mori, 1989 | gas phase |
By formula: (CHO+ • 12CO) + CO = (CHO+ • 13CO)
Quantity | Value | Units | Method | Reference | Comment |
---|---|---|---|---|---|
ΔrH° | 1.8 ± 0.3 | kcal/mol | PHPMS | Hiraoka and Mori, 1989 | gas phase |
Quantity | Value | Units | Method | Reference | Comment |
ΔrS° | 23.2 | cal/mol*K | PHPMS | Hiraoka and Mori, 1989 | gas phase |
By formula: (CHO+ • 13CO) + CO = (CHO+ • 14CO)
Quantity | Value | Units | Method | Reference | Comment |
---|---|---|---|---|---|
ΔrH° | 1.8 ± 0.3 | kcal/mol | PHPMS | Hiraoka and Mori, 1989 | gas phase |
Quantity | Value | Units | Method | Reference | Comment |
ΔrS° | 23.1 | cal/mol*K | PHPMS | Hiraoka and Mori, 1989 | gas phase |
By formula: (CHO+ • 14CO) + CO = (CHO+ • 15CO)
Quantity | Value | Units | Method | Reference | Comment |
---|---|---|---|---|---|
ΔrH° | 1.76 | kcal/mol | PHPMS | Hiraoka and Mori, 1989 | gas phase; Entropy change calculated or estimated |
Quantity | Value | Units | Method | Reference | Comment |
ΔrS° | 23. | cal/mol*K | N/A | Hiraoka and Mori, 1989 | gas phase; Entropy change calculated or estimated |
By formula: CHO+ + CO2 = (CHO+ • CO2)
Quantity | Value | Units | Method | Reference | Comment |
---|---|---|---|---|---|
ΔrH° | 12.6 | kcal/mol | PHPMS | Hiraoka, Shoda, et al., 1986 | gas phase |
Quantity | Value | Units | Method | Reference | Comment |
ΔrS° | 21.4 | cal/mol*K | PHPMS | Hiraoka, Shoda, et al., 1986 | gas phase |
By formula: (CHO+ • CO2) + CO2 = (CHO+ • 2CO2)
Quantity | Value | Units | Method | Reference | Comment |
---|---|---|---|---|---|
ΔrH° | 7.2 | kcal/mol | PHPMS | Hiraoka, Shoda, et al., 1986 | gas phase |
Quantity | Value | Units | Method | Reference | Comment |
ΔrS° | 19.7 | cal/mol*K | PHPMS | Hiraoka, Shoda, et al., 1986 | gas phase |
By formula: (CHO+ • 2CO2) + CO2 = (CHO+ • 3CO2)
Quantity | Value | Units | Method | Reference | Comment |
---|---|---|---|---|---|
ΔrH° | 6.9 | kcal/mol | PHPMS | Hiraoka, Shoda, et al., 1986 | gas phase |
Quantity | Value | Units | Method | Reference | Comment |
ΔrS° | 22.7 | cal/mol*K | PHPMS | Hiraoka, Shoda, et al., 1986 | gas phase |
By formula: (CHO+ • 3CO2) + CO2 = (CHO+ • 4CO2)
Quantity | Value | Units | Method | Reference | Comment |
---|---|---|---|---|---|
ΔrH° | 8.4 | kcal/mol | PHPMS | Hiraoka, Shoda, et al., 1986 | gas phase; Entropy change calculated or estimated |
Quantity | Value | Units | Method | Reference | Comment |
ΔrS° | 24. | cal/mol*K | N/A | Hiraoka, Shoda, et al., 1986 | gas phase; Entropy change calculated or estimated |
By formula: CHO+ + H2 = (CHO+ • H2)
Quantity | Value | Units | Method | Reference | Comment |
---|---|---|---|---|---|
ΔrH° | 3.9 | kcal/mol | PHPMS | Hiraoka and Kebarle, 1975 | gas phase |
Quantity | Value | Units | Method | Reference | Comment |
ΔrS° | 20.5 | cal/mol*K | PHPMS | Hiraoka and Kebarle, 1975 | gas phase |

References

Jennings, Headley, et al., 1982
Jennings, K.R.; Headley, J.V.; Mason, R.S.,
The Temperature Dependence of Ion - Molecule Association Reactions,
Int. J. Mass. Spectrom. Ion Phys, 1982, 45, 315. [all data]
Hiraoka, Saluja, et al., 1979
Hiraoka, K.; Saluja, P.P.S.; Kebarle, P.,
Stabilities of Complexes (N2)nH+, (CO)nH+ and (O2)nH+ for n = 1 to 7 Based on Gas Phase Ion Equilibrium Measurements,
Can. J. Chem., 1979, 57, 16, 2159, https://doi.org/10.1139/v79-346
. [all data]
Meot-Ner (Mautner) and Field, 1974
Meot-Ner (Mautner), M.; Field, F.H.,
Kinetics and Thermodynamics of the Association of CO+ with CO and of N2+ with N2 between 120 and 650 K,
J. Chem. Phys., 1974, 61, 9, 3742, https://doi.org/10.1063/1.1682560
. [all data]
Hiraoka and Mori, 1989
Hiraoka, K.; Mori, T.,
Gas Phase Stabilities of the Cluster Ions H+(CO)2(CO)n, H+(N2)2(N2)n and H+(O2)2(O2)n with n = 1 - 14,
Chem. Phys., 1989, 137, 1-3, 345, https://doi.org/10.1016/0301-0104(89)87119-8
. [all data]
Hiraoka, Shoda, et al., 1986
Hiraoka, K.; Shoda, T.; Morise, K.; Yamabe, S.; Kawai, E.; Hirao, K.,
Stability and structure of cluster ions in the gas phase: Carbon dioxide with Cl-, H3O+, HCO2+ and HCO+,
J. Chem. Phys., 1986, 84, 2091. [all data]
Hiraoka and Kebarle, 1975
Hiraoka, K.; Kebarle, P.,
Stability and Structure of H3CO+ Formed from COH+ + H2 at Low Temperature,
J. Chem. Phys., 1975, 63, 4, 1688, https://doi.org/10.1063/1.431499
. [all data]