Rhenium tetrafluoride oxide
- Formula: F4ORe
- Molecular weight: 278.200
- IUPAC Standard InChIKey: ZFISRUVPYVGWSJ-UHFFFAOYSA-J
- CAS Registry Number: 17026-29-8
- Chemical structure:
View 3d structure (requires JavaScript / HTML 5) - Other names: Rhenium fluoride oxide (ReF4O); ReOF4

Gas phase ion energetics data

Data compiled as indicated in comments:
LLK - Sharon G. Lias, Rhoda D. Levin, and Sherif A. Kafafi
Ionization energy determinations
IE (eV) | Method | Reference | Comment |
---|---|---|---|
10.5 | PE | Vovna, Dudin, et al., 1981 | LLK |
10.98 | PE | Vovna, Dudin, et al., 1981 | Vertical value; LLK |

References

Vovna, Dudin, et al., 1981
Vovna, V.I.; Dudin, A.S.; Kleshchevnikov, A.M.; Lopatin, S.N.; Rakov, E.G.,
Photoelectron spectra and electronic structure of molybdenum, tungsten, rhonium, and osmium oxotetrafluorides,
Koord. Khim., 1981, 7, 575. [all data]