Benzaldehyde, 3-(phenylmethoxy)-
- Formula: C14H12O2
- Molecular weight: 212.2439
- IUPAC Standard InChIKey: JAICGBJIBWDEIZ-UHFFFAOYSA-N
- CAS Registry Number: 1700-37-4
- Chemical structure:
View 3d structure (requires JavaScript / HTML 5) - Other names: Benzaldehyde, m-(benzyloxy)-; m-Benzyloxybenzaldehyde; 3-Benzyloxybenzaldehyde; Benzyl 3-formylphenyl ether

Gas phase ion energetics data

Data compiled by: Henry M. Rosenstock, Keith Draxl, Bruce W. Steiner, and John T. Herron
Ionization energy determinations
IE (eV) | Method | Reference |
---|---|---|
8.6 | EI | Ward, Cooks, et al., 1969 |
Appearance energy determinations
Ion | AE (eV) | Other Products | Method | Reference | Comment |
---|---|---|---|---|---|
C7H5O2+ | 11.5 | ? | EI | Ward, Cooks, et al., 1969 | |
C7H7+ | 9.7 | ? | EI | Ward, Cooks, et al., 1969 |

References

Ward, Cooks, et al., 1969
Ward, R.S.; Cooks, R.d.; Williams, D.H.,
Substituent effects in mass spectrometry. Mass spectra of substituted phenyl benzyl ethers,
J. Am. Chem. Soc., 1969, 91, 2727. [all data]