1,3-Cyclooctadiene
- Formula: C8H12
- Molecular weight: 108.1809
- IUPAC Standard InChIKey: RRKODOZNUZCUBN-PBIXIIOPSA-N
- CAS Registry Number: 1700-10-3
- Chemical structure:
View 3d structure (requires JavaScript / HTML 5) - Stereoisomers:
- Other names: cycloocta-1,3-diene

Gas phase thermochemistry data

Data compiled by: Glushko Thermocenter, Russian Academy of Sciences, Moscow
Constant pressure heat capacity of gas
Cp,gas (J/mol*K) | Temperature (K) | Reference | Comment |
---|---|---|---|
39.51 | 50. | Dorofeeva O.V., 1986 | |
61.28 | 100. | ||
77.99 | 150. | ||
95.59 | 200. | ||
127.07 | 273.15 | ||
138.8 ± 6.0 | 298.15 | ||
139.70 | 300. | ||
186.56 | 400. | ||
227.96 | 500. | ||
262.46 | 600. | ||
291.08 | 700. | ||
315.06 | 800. | ||
335.36 | 900. | ||
352.64 | 1000. | ||
367.42 | 1100. | ||
380.10 | 1200. | ||
391.01 | 1300. | ||
400.42 | 1400. | ||
408.57 | 1500. |

Reaction thermochemistry data

Data compiled by: John E. Bartmess
Individual Reactions
C8H11- + =
By formula: C8H11- + H+ = C8H12
Quantity | Value | Units | Method | Reference | Comment |
---|---|---|---|---|---|
ΔrH° | 1576. ± 13. | kJ/mol | G+TS | Lee and Squires, 1986 | gas phase; Between EtOH, nPrOH; value altered from reference due to change in acidity scale |
Quantity | Value | Units | Method | Reference | Comment |
ΔrG° | 1548. ± 13. | kJ/mol | IMRB | Lee and Squires, 1986 | gas phase; Between EtOH, nPrOH; value altered from reference due to change in acidity scale |

Gas phase ion energetics data

Data compiled as indicated in comments:
B - John E. Bartmess
LLK - Sharon G. Lias, Rhoda D. Levin, and Sherif A. Kafafi
Ionization energy determinations
IE (eV) | Method | Reference | Comment |
---|---|---|---|
8.4 | PE | Batich, Bischof, et al., 1973 | LLK |
De-protonation reactions
C8H11- + =
By formula: C8H11- + H+ = C8H12
Quantity | Value | Units | Method | Reference | Comment |
---|---|---|---|---|---|
ΔrH° | 1576. ± 13. | kJ/mol | G+TS | Lee and Squires, 1986 | gas phase; Between EtOH, nPrOH; value altered from reference due to change in acidity scale; B |
Quantity | Value | Units | Method | Reference | Comment |
ΔrG° | 1548. ± 13. | kJ/mol | IMRB | Lee and Squires, 1986 | gas phase; Between EtOH, nPrOH; value altered from reference due to change in acidity scale; B |

Normal alkane RI, non-polar column, temperature ramp

Column type | Active phase | I | Reference | Comment |
---|---|---|---|---|
Capillary | Petrocol DH | 894. | Supelco, 2012 | 100. m/0.25 mm/0.50 μm, Helium, 20. C @ 15. min, 15. K/min, 220. C @ 30. min |

Normal alkane RI, polar column, custom temperature program

Column type | Active phase | I | Reference | Comment |
---|---|---|---|---|
Capillary | DB-Wax | 1100. | Peng, Yang, et al., 1991 | Program: not specified |

References

Dorofeeva O.V., 1986
Dorofeeva O.V.,
Thermodynamic properties of twenty-one monocyclic hydrocarbons,
J. Phys. Chem. Ref. Data, 1986, 15, 437-464. [all data]
Lee and Squires, 1986
Lee, R.E.; Squires, R.R.,
Anionic homoaromaticity: A gas phase experimental study,
J. Am. Chem. Soc., 1986, 105, 5078. [all data]
Batich, Bischof, et al., 1973
Batich, C.; Bischof, P.; Heilbronner, E.,
The photoelectron spectra of cyclooctatetraene and its hydrogenated derivatives,
J. Electron Spectrosc. Relat. Phenom., 1973, 1, 333. [all data]
Supelco, 2012
Supelco, CatalogNo. 24160-U,
Petrocol DH Columns. Catalog No. 24160-U, 2012, retrieved from http://www.sigmaaldrich.com/etc/medialib/docs/Supelco/Datasheet/1/w97949.Par.0001.File.tmp/w97949.pdf. [all data]
Peng, Yang, et al., 1991
Peng, C.T.; Yang, Z.C.; Ding, S.F.,
Prediction of rentention idexes. II. Structure-retention index relationship on polar columns,
J. Chromatogr., 1991, 586, 1, 85-112, https://doi.org/10.1016/0021-9673(91)80028-F
. [all data]