Butadiyne-d2
- Formula: C4D2
- Molecular weight: 52.0710
- IUPAC Standard InChIKey: LLCSWKVOHICRDD-QDNHWIQGSA-N
- CAS Registry Number: 16954-96-4
- Chemical structure:
View 3d structure (requires JavaScript / HTML 5) - Isotopologues:

Gas phase ion energetics data

Data compiled by: Henry M. Rosenstock, Keith Draxl, Bruce W. Steiner, and John T. Herron
Ionization energy determinations
IE (eV) | Method | Reference |
---|---|---|
10.180 ± 0.003 | S | Smith, 1967 |
10.18 ± 0.01 | PE | Baker and Turner, Commun. 1967 |

References

Smith, 1967
Smith, W.L.,
The absorption spectrum of diacetylene in the vacuum ultraviolet,
Proc. Roy. Soc. (London), 1967, A300, 519. [all data]
Baker and Turner, Commun. 1967
Baker, C.; Turner, D.W.,
Photoelectron spectra of acetylene, diacetylene, and their deutero-derivatives,
Chem., Commun. 1967, 797. [all data]