Rhodium, hydrotetrakis(phosphorus trifluoride)-

Gas phase ion energetics data

Data compiled by: Sharon G. Lias, Rhoda D. Levin, and Sherif A. Kafafi

Ionization energy determinations

IE (eV) Method Reference Comment
9.7PENixon, 1973
9.70PEHead, Nixon, et al., 1975Vertical value

References

Nixon, 1973
Nixon, J.F., Photoelectron spectra and bonding in metal-trifluorophosphine complexes, J. Chem. Soc. Dalton Trans., 1973, 21, 2226. [all data]

Head, Nixon, et al., 1975
Head, R.A.; Nixon, J.F.; Sharp, G.J.; Clark, R.J., Photoelectron spectroscopic study of metal trifluorophosphine and hydridotrifluorophosphine complexes, J. Chem. Soc. Dalton Trans., 1975, 2054. [all data]