(E)-1-Phenyl-1,3-butadiene
- Formula: C10H10
- Molecular weight: 130.1864
- IUPAC Standard InChIKey: XZKRXPZXQLARHH-XVNBXDOJSA-N
- CAS Registry Number: 16939-57-4
- Chemical structure:
View 3d structure (requires JavaScript / HTML 5) - Stereoisomers:

Phase change data

Data compiled by: Robert L. Brown and Stephen E. Stein
Reduced pressure boiling point
Tboil (K) | Pressure (bar) | Reference |
---|---|---|
349.2 | 0.015 | Weast and Grasselli, 1989 |

Gas phase ion energetics data

Data compiled as indicated in comments:
LBLHLM - Sharon G. Lias, John E. Bartmess, Joel F. Liebman, John L. Holmes, Rhoda D. Levin, and W. Gary Mallard
LLK - Sharon G. Lias, Rhoda D. Levin, and Sherif A. Kafafi
Ionization energy determinations
IE (eV) | Method | Reference | Comment |
---|---|---|---|
8.06 ± 0.07 | EI | Dass and Gross, 1983 | LBLHLM |
7.95 | PE | Sustmann and Schubert, 1972 | LLK |

References

Weast and Grasselli, 1989
CRC Handbook of Data on Organic Compounds, 2nd Editon, Weast,R.C and Grasselli, J.G., ed(s)., CRC Press, Inc., Boca Raton, FL, 1989, 1. [all data]
Dass and Gross, 1983
Dass, C.; Gross, M.L.,
Electrocyclic ring opening of 1-phenylcyclobutene and 3-phenylcyclobutene radical cations,
J. Am. Chem. Soc., 1983, 105, 5724. [all data]
Sustmann and Schubert, 1972
Sustmann, R.; Schubert, R.,
Photoelektronenspektroskopische bestimmung von substituenten-effekten. I. Subtituierte butadiene,
Tetrahedron Lett., 1972, 27, 2739. [all data]