Chlorofluoromethylene
- Formula: CClF
- Molecular weight: 66.462
- IUPAC Standard InChIKey: KYKAJFCTULSVSH-UHFFFAOYSA-N
- CAS Registry Number: 1691-88-9
- Chemical structure:
View 3d structure (requires JavaScript / HTML 5) - Permanent link for this species. Use this link for bookmarking this species for future reference.

Gas phase ion energetics data

Data evaluated as indicated in comments:
HL - Edward P. Hunter and Sharon G. Lias
Data compiled as indicated in comments:
LL - Sharon G. Lias and Joel F. Liebman
LBLHLM - Sharon G. Lias, John E. Bartmess, Joel F. Liebman, John L. Holmes, Rhoda D. Levin, and W. Gary Mallard
Quantity | Value | Units | Method | Reference | Comment |
---|---|---|---|---|---|
Proton affinity (review) | 184.6 | kcal/mol | N/A | Hunter and Lias, 1998 | HL |
Quantity | Value | Units | Method | Reference | Comment |
Gas basicity | 176.9 | kcal/mol | N/A | Hunter and Lias, 1998 | HL |
Ionization energy determinations
IE (eV) | Method | Reference | Comment |
---|---|---|---|
12. ± 1. | DER | Langford and Harris, 1990 | LL |
10.7 | DER | Lias, Bartmess, et al., 1988 | LL |
10.62 | DER | Lias, Karpas, et al., 1985 | LBLHLM |

Vibrational and/or electronic energy levels

Data compiled by: Marilyn E. Jacox

State:   A

 Energy
 (cm-1
 Med.   Transition   λmin
 (nm)
 λmax
 (nm)

References

Hunter and Lias, 1998
Hunter, E.P.; Lias, S.G.,
Evaluated Gas Phase Basicities and Proton Affinities of Molecules: An Update,
J. Phys. Chem. Ref. Data, 1998, 27, 3, 413-656, https://doi.org/10.1063/1.556018
. [all data]
Langford and Harris, 1990
Langford, M.L.; Harris, F.M.,
Experimental determination of the energies required to ionize the ions CFCl+, CFBr+, CClBr+, CF2Cl+, CF2Br+, CCl2F+, CBr2F+, and CBr2Cl+,
Int. J. Mass Spectrom. Ion Phys., 1990, 96, 111. [all data]
Lias, Bartmess, et al., 1988
Lias, S.G.; Bartmess, J.E.; Liebman, J.F.; Holmes, J.L.; Levin, R.D.; Mallard, W.G.,
Gas-phase ion and neutral thermochemistry,
J. Phys. Chem. Ref. Data, Suppl. 1, 1988, 17, 1-861. [all data]
Lias, Karpas, et al., 1985
Lias, S.G.; Karpas, Z.; Liebman, J.F.,
Halomethylenes: Effects of halogen substitution on absolute heats of formation,
J. Am. Chem. Soc., 1985, 107, 6089. [all data]