Dinaphtho[2,1-c:1',2'-g]phenanthrene
- Formula: C30H18
- Molecular weight: 378.4639
- IUPAC Standard InChIKey: ZADYHNRFHQXTOH-UHFFFAOYSA-N
- CAS Registry Number: 16914-68-4
- Chemical structure:
View 3d structure (requires JavaScript / HTML 5) - Permanent link for this species. Use this link for bookmarking this species for future reference.

Gas phase ion energetics data

Data compiled as indicated in comments:
LLK - Sharon G. Lias, Rhoda D. Levin, and Sherif A. Kafafi
Ionization energy determinations
IE (eV) | Method | Reference | Comment |
---|---|---|---|
7.25 | PE | Obenland and Schmidt, 1975 | LLK |
7.25 | PE | Obenland and Schmidt, 1975 | Vertical value; LLK |

References

Obenland and Schmidt, 1975
Obenland, S.; Schmidt, W.,
Photoelectron spectra of polynuclear aromatics. IV. The helicenes,
J. Am. Chem. Soc., 1975, 97, 6633. [all data]