Thiophene, 2-(1,1-dimethylethyl)-
- Formula: C8H12S
- Molecular weight: 140.246
- IUPAC Standard InChIKey: SWCDOJGIOCVXFM-UHFFFAOYSA-N
- CAS Registry Number: 1689-78-7
- Chemical structure:
View 3d structure (requires JavaScript / HTML 5) - Other names: Thiophene, 2-tert-butyl-; 2-tert-Butylthiophene

Phase change data

Data compiled by: Thermodynamics Research Center, NIST Boulder Laboratories, Chris Muzny director
Quantity | Value | Units | Method | Reference | Comment |
---|---|---|---|---|---|
Tboil | 437.1 | K | N/A | Appleby, Sartor, et al., 1948 | Uncertainty assigned by TRC = 0.6 K |
Quantity | Value | Units | Method | Reference | Comment |
Tfus | 214.0 | K | N/A | Appleby, Sartor, et al., 1948 | Uncertainty assigned by TRC = 0.8 K |

Gas phase ion energetics data

Data compiled as indicated in comments:
LBLHLM - Sharon G. Lias, John E. Bartmess, Joel F. Liebman, John L. Holmes, Rhoda D. Levin, and W. Gary Mallard
LLK - Sharon G. Lias, Rhoda D. Levin, and Sherif A. Kafafi
Ionization energy determinations
IE (eV) | Method | Reference | Comment |
---|---|---|---|
8.3 | PE | Veszpremi, Harada, et al., 1983 | LBLHLM |
8.48 | CTS | Aloisi, Santini, et al., 1975 | LLK |
8.32 | PE | Veszpremi, Harada, et al., 1983 | Vertical value; LBLHLM |

Kovats' RI, non-polar column, isothermal

Column type | Active phase | Temperature (C) | I | Reference | Comment |
---|---|---|---|---|---|
Packed | Apiezon M | 130. | 989. | Garbuzov, Misharina, et al., 1985 | He or N2, Chromosorb W, AW-DMCS; Column length: 2.1 m |
Packed | Apiezon M | 130. | 989. | Golovnya, Garbuzov, et al., 1978 | Chromosorb W, AW/DMS; Column length: 2.1 m |

References

Appleby, Sartor, et al., 1948
Appleby, W.G.; Sartor, A.F.; Lee, S.H.; Kapranos, S.W.,
Alkylation of Thiphene with Olefins,
J. Am. Chem. Soc., 1948, 70, 1552. [all data]
Veszpremi, Harada, et al., 1983
Veszpremi, T.; Harada, Y.; Ohno, K.; Mutoh, H.,
Photoelectron and penning ionization electron spectroscopic investigation of trimethylsilyl- and t-butyl-thiophenes,
J. Organomet. Chem., 1983, 252, 121. [all data]
Aloisi, Santini, et al., 1975
Aloisi, G.; Santini, S.; Savelli, G.,
Molecular complexes of heteroaromatic five membered ring compounds with tetracyanoethylene. Charge transfer spectra, equilibrium constants and ionization potentials of the donors,
J. Chem. Soc. Faraday Trans. 1, 1975, 70, 2045. [all data]
Garbuzov, Misharina, et al., 1985
Garbuzov, V.G.; Misharina, T.A.; Aerov, A.F.; Golovnya, R.V.,
Gas chromatographic retention indices for sulphur(II)-containing organic substances,
J. Anal. Chem. USSR (Engl. Transl.), 1985, 40, 4, 576-586. [all data]
Golovnya, Garbuzov, et al., 1978
Golovnya, R.V.; Garbuzov, V.G.; Aerov, A.F.,
Gas chromatographic characterization of sulfur-containing compounds. 5. Thiophene, furan, and benzene derivatives,
Izv. Akad. Nauk SSSR Ser. Khim., 1978, 11, 2271-2274. [all data]