Thiacyclohex-3-ene, 1,1-dioxide
- Formula: C5H8O2S
- Molecular weight: 132.181
- IUPAC Standard InChIKey: GAFNNBCHKMQQQB-UHFFFAOYSA-N
- CAS Registry Number: 16841-46-6
- Chemical structure:
View 3d structure (requires JavaScript / HTML 5) - Permanent link for this species. Use this link for bookmarking this species for future reference.

Gas phase ion energetics data

Data compiled by: Sharon G. Lias, John E. Bartmess, Joel F. Liebman, John L. Holmes, Rhoda D. Levin, and W. Gary Mallard
Ionization energy determinations
IE (eV) | Method | Reference | Comment |
---|---|---|---|
10.03 | PE | Kuhn, Klessinger, et al., 1987 | Vertical value |

References

Kuhn, Klessinger, et al., 1987
Kuhn, H.J.; Klessinger, M.; Ruscic, B.; Klasinc, L.,
On the empirical correlation schemes for ionization energies in ring compounds,
Int. J. Mass Spectrom. Ion Phys., 1987, 43, 147. [all data]