tris(1,1,1,5,5,5-hexafluoropentane-2,4-dionato-O,O')ruthenium
- Formula: C15H3F18O6Ru
- Molecular weight: 722.22
- CAS Registry Number: 16827-63-7

Phase change data

Data compiled by: William E. Acree, Jr., James S. Chickos
Quantity | Value | Units | Method | Reference | Comment |
---|---|---|---|---|---|
ΔsubH° | 27.37 ± 0.24 | kcal/mol | ME | Ribeiro da Silva, Monte, et al., 2001 |
Enthalpy of sublimation
ΔsubH (kcal/mol) | Temperature (K) | Method | Reference | Comment |
---|---|---|---|---|
27.27 ± 0.24 | 306. | ME | Ribeiro da Silva, Monte, et al., 2001 | Based on data from 299. to 313. K. |

Gas phase ion energetics data

Data compiled by: Sharon G. Lias, Rhoda D. Levin, and Sherif A. Kafafi
Ionization energy determinations
IE (eV) | Method | Reference | Comment |
---|---|---|---|
8.85 ± 0.07 | PE | Evans, Hamnett, et al., 1972 | Vertical value |

References

Ribeiro da Silva, Monte, et al., 2001
Ribeiro da Silva, Manuel A.V.; Monte, Manuel J.S.; Giera, Edward,
Thermodynamic study of the sublimation of crystalline tris(1,1,1-trifluoro-2,4-pentanedionate)ruthenium(III) and tris(1,1,1,5,5,5-hexafluoro-2,4-pentanedionate)ruthenium(III),
The Journal of Chemical Thermodynamics, 2001, 33, 4, 369-376, https://doi.org/10.1006/jcht.2000.0734
. [all data]
Evans, Hamnett, et al., 1972
Evans, S.; Hamnett, A.; Orchard, A.F.; Lloyd, D.R.,
Study of the metal-oxygen bond in simple tris-chelate complexes by He(I) photoelectron spectroscopy,
Faraday Discuss. Chem. Soc., 1972, 54, 227. [all data]