2,5-Diphenyl-2,4-hexadiene
- Formula: C18H18
- Molecular weight: 234.3355
- IUPAC Standard InChIKey: GGZMJMQKUXVBCQ-VMNXYWKNSA-N
- CAS Registry Number: 16819-47-9
- Chemical structure:
View 3d structure (requires JavaScript / HTML 5) - Other names: [1-Methyl-4-phenyl-1,3-pentadienyl]benzene; 2,4-Hexadiene, 2,5-diphenyl-; 1,6-Diphenylhexadiene

Gas phase ion energetics data

Data compiled by: Henry M. Rosenstock, Keith Draxl, Bruce W. Steiner, and John T. Herron
Ionization energy determinations
IE (eV) | Method | Reference |
---|---|---|
8.2 | CTS | Briegleb and Czekalla, 1959 |

References

Briegleb and Czekalla, 1959
Briegleb, G.; Czekalla, J.,
Die Bestimmung von lonisierungsenergien aus den Spektren von Elektronenubergangskomplexen,
Z.Elektrochem., 1959, 63, 6. [all data]