3H-1,4-Benzodiazepin-2-one, 1,2-dihydro-
- Formula: C9H8N2O
- Molecular weight: 160.1726
- IUPAC Standard InChIKey: UDLAUVFRZXIQJS-UHFFFAOYSA-N
- CAS Registry Number: 16780-62-4
- Chemical structure:
View 3d structure (requires JavaScript / HTML 5) - Permanent link for this species. Use this link for bookmarking this species for future reference.

Gas phase ion energetics data

Data compiled by: Sharon G. Lias and Joel F. Liebman
Ionization energy determinations
IE (eV) | Method | Reference |
---|---|---|
7.8 | PE | Andronati, Khvostenko, et al., 1989 |

References

Andronati, Khvostenko, et al., 1989
Andronati, S.A.; Khvostenko, V.I.; Khvostenko, O.G.; Fal'ko, V.S.; Zykov, B.G.; Prokopenko, I.A.; Yavorskii, A.S.; Lukin, V.G.,
Conformational lability of 1,4-benzdiazepin-2-ones,
Dokl. Phys. Chem., 1989, 305, 77. [all data]