Xenon monofluoride
- Formula: FXe
- Molecular weight: 150.291
- IUPAC Standard InChIKey: VJVUOJVKEWVFBF-UHFFFAOYSA-N
- CAS Registry Number: 16757-14-5
- Chemical structure:
View 3d structure (requires JavaScript / HTML 5) - Permanent link for this species. Use this link for bookmarking this species for future reference.

Gas phase ion energetics data

Data compiled as indicated in comments:
LL - Sharon G. Lias and Joel F. Liebman
LLK - Sharon G. Lias, Rhoda D. Levin, and Sherif A. Kafafi
Ionization energy determinations
IE (eV) | Method | Reference | Comment |
---|---|---|---|
10.3 | DER | Lias, Bartmess, et al., 1988 | LL |
≤10.23 | DER | Huber and Herzberg, 1979 | LLK |

Constants of diatomic molecules

Data compiled by: Klaus P. Huber and Gerhard H. Herzberg
Data collected through November, 1977
Symbol | Meaning |
---|---|
State | electronic state and / or symmetry symbol |
Te | minimum electronic energy (cm-1) |
ωe | vibrational constant – first term (cm-1) |
ωexe | vibrational constant – second term (cm-1) |
ωeye | vibrational constant – third term (cm-1) |
Be | rotational constant in equilibrium position (cm-1) |
αe | rotational constant – first term (cm-1) |
γe | rotation-vibration interaction constant (cm-1) |
De | centrifugal distortion constant (cm-1) |
βe | rotational constant – first term, centrifugal force (cm-1) |
re | internuclear distance (Å) |
Trans. | observed transition(s) corresponding to electronic state |
ν00 | position of 0-0 band (units noted in table) |
State | Te | ωe | ωexe | ωeye | Be | αe | γe | De | βe | re | Trans. | ν00 |
---|---|---|---|---|---|---|---|---|---|---|---|---|
D (2Π1/2) | 38057 | 351 H | 2.1 | D ↔ X 1 V | 38118 H | |||||||
↳Kuznetsova, Kuzyakov, et al., 1964; Brau and Ewing, 1975; Velazco, Kolts, et al., 1976; missing citation | ||||||||||||
B (2Π1/2) | 28826 | (308.6) (Z) | 1.52 | B ↔ X 2 3 V | 28866 | |||||||
↳Kuznetsova, Kuzyakov, et al., 1964; missing citation; Brau and Ewing, 1975; Golde, 1975; Tellinghuisen, Tisone, et al., 1976; Velazco, Kolts, et al., 1976 | ||||||||||||
C (2Π3/2) | (25550) | (370) 4 | C → A | (18600) | ||||||||
↳Ault and Andrews, 1976 | ||||||||||||
A (2Π3/2) | 5 | 4 | C ← X | (25620) | ||||||||
↳Ault and Andrews, 1976 | ||||||||||||
State | Te | ωe | ωexe | ωeye | Be | αe | γe | De | βe | re | Trans. | ν00 |
X (2Σ) | 0 | (234.2) 6 (Z) | 12.0 7 | |||||||||
↳Morton and Falconer, 1963; Eachus and Symons, 1971 |

References

Lias, Bartmess, et al., 1988
Lias, S.G.; Bartmess, J.E.; Liebman, J.F.; Holmes, J.L.; Levin, R.D.; Mallard, W.G.,
Gas-phase ion and neutral thermochemistry,
J. Phys. Chem. Ref. Data, Suppl. 1, 1988, 17, 1-861. [all data]
Huber and Herzberg, 1979
Huber, K.P.; Herzberg, G.,
Molecular Spectra and Molecular Structure. IV. Constants of Diatomic Molecules,, Van Nostrand Reinhold Co., 1979, ,1. [all data]
Kuznetsova, Kuzyakov, et al., 1964
Kuznetsova, L.A.; Kuzyakov, Yu.Ya.; Shpanskii, V.A.; Khutoretskii, V.M.,
Emission spectra of XeF and XeF2 molecules,
Vestn. Mosk. Univ., 1964, 19, 19-21. [all data]
Brau and Ewing, 1975
Brau, C.A.; Ewing, J.J.,
Emission spectra of XeBr, XeCl, XeF, and KrF,
J. Chem. Phys., 1975, 63, 4640. [all data]
Velazco, Kolts, et al., 1976
Velazco, J.E.; Kolts, J.H.; Setser, D.W.,
Quenching rate constants for metastable argon, krypton, and xenon atoms by fluorine containing molecules and branching for XeF and KrF formation,
J. Chem. Phys., 1976, 65, 3468. [all data]
Golde, 1975
Golde, M.F.,
Interpretation of the oscillatory spectra of the inert-gas halides,
J. Mol. Spectrosc., 1975, 58, 261. [all data]
Tellinghuisen, Tisone, et al., 1976
Tellinghuisen, J.; Tisone, G.C.; Hoffman, J.M.; Hays, A.K.,
Analysis of spontaneous and laser emission from XeF,
J. Chem. Phys., 1976, 64, 4796. [all data]
Ault and Andrews, 1976
Ault, B.S.; Andrews, L.,
Absorption and emission spectra of argon matrix-isolated XeF and KrF,
J. Chem. Phys., 1976, 64, 3075. [all data]
Morton and Falconer, 1963
Morton, J.R.; Falconer, W.E.,
Electron spin resonance spectrum of XeF in γ-irradiated xenon tetrafluoride,
J. Chem. Phys., 1963, 39, 427. [all data]
Eachus and Symons, 1971
Eachus, R.S.; Symons, M.C.R.,
Unstable intermediates. Part LXXXIV. E.s.r. study of the radical XeF in γ-irradiated XeF2,
J. Chem. Soc. A, 1971, 304. [all data]
Velazco, Kolts, et al., 1977
Velazco, J.E.; Kolts, J.H.; Setser, D.W.; Coxon, J.A.,
Excitation of XeF* by reactions of XeF2 with Ar(3P0,2), Kr(3P2) and Xe(3P2),
Chem. Phys. Lett., 1977, 46, 99. [all data]
Goodman and Brus, 1976
Goodman, J.; Brus, L.E.,
Ground X2Σ+ state potential well, and excited state dynamics of diatomic XeF in solid Ne and Ar,
J. Chem. Phys., 1976, 65, 3808. [all data]
Burnham and Harris, 1977
Burnham, R.; Harris, N.W.,
Radiative lifetime of the C state of XeF,
J. Chem. Phys., 1977, 66, 2742. [all data]
Velazco and Setser, 1975
Velazco, J.E.; Setser, D.W.,
Bound-free emission spectra of diatomic xenon halides,
J. Chem. Phys., 1975, 62, 1990. [all data]
Ault, Bradford, et al., 1975
Ault, E.R.; Bradford, R.S., Jr.; Bhaumik, M.L.,
High-power xenon fluoride laser,
Appl. Phys. Lett., 1975, 27, 413. [all data]
Brau and Ewing, 1975, 2
Brau, C.A.; Ewing, J.J.,
354-nm laser action on XeF,
Appl. Phys. Lett., 1975, 27, 435. [all data]
Brashears, Setser, et al., 1977
Brashears, H.C., Jr.; Setser, D.W.; Desmarteau, D.,
Vacuum-ultraviolet photolysis of XeF2: XeF(B) fluorescence and quenching,
Chem. Phys. Lett., 1977, 48, 84. [all data]
Liskow, Schaefer, et al., 1973
Liskow, D.H.; Schaefer, H.F., III; Bagus, P.S.; Liu, B.,
Probable nonexistence of xenon monofluoride as a chemically bound species in the gas phase,
J. Am. Chem. Soc., 1973, 95, 4056. [all data]
Krauss and Liu, 1976
Krauss, M.; Liu, B.,
The energy curve of XeF, X2Σ+,
Chem. Phys. Lett., 1976, 44, 257. [all data]