Ethyl N,N-dimethyloxamate
- Formula: C6H11NO3
- Molecular weight: 145.1564
- IUPAC Standard InChIKey: HMALWDVRMHVUAW-UHFFFAOYSA-N
- CAS Registry Number: 16703-52-9
- Chemical structure:
View 3d structure (requires JavaScript / HTML 5) - Species with the same structure:
- Other names: Acetic acid, (dimethylamino)oxo-, ethyl ester; N,N-Dimethyl ethyl oxamate; Oxamic acid, dimethyl-, ethyl ester; ethyl (dimethylamino)oxoacetate

Phase change data

Data compiled by: Robert L. Brown and Stephen E. Stein
Reduced pressure boiling point
Tboil (K) | Pressure (bar) | Reference |
---|---|---|
402. to 403. | 0.027 | Frinton Laboratories Inc., 1986 |

Gas phase ion energetics data

Data compiled by: Sharon G. Lias, Rhoda D. Levin, and Sherif A. Kafafi
Ionization energy determinations
IE (eV) | Method | Reference | Comment |
---|---|---|---|
9.31 | PE | Meeks and McGlynn, 1975 | Vertical value |

References

Frinton Laboratories Inc., 1986
Frinton Laboratories Inc.,
Catalog Number 11, Frinton Laboratories Inc., Vineland, NJ, 1986, 99. [all data]
Meeks and McGlynn, 1975
Meeks, J.L.; McGlynn, S.P.,
Photoelectron spectra of carbonyls. Oxalyl chloride, ethyl oxalyl chloride, ethyl oxamate and N,N-dimethyl ethyl oxamate,
Spectrosc. Lett., 1975, 8, 439. [all data]