Ethanethione,1-phenyl-
- Formula: C8H8S
- Molecular weight: 136.214
- IUPAC Standard InChIKey: QFMNMSJTKVHTSY-UHFFFAOYSA-N
- CAS Registry Number: 16696-68-7
- Chemical structure:
View 3d structure (requires JavaScript / HTML 5) - Permanent link for this species. Use this link for bookmarking this species for future reference.

Gas phase ion energetics data

Data compiled by: Sharon G. Lias, Rhoda D. Levin, and Sherif A. Kafafi
Ionization energy determinations
IE (eV) | Method | Reference | Comment |
---|---|---|---|
8.1 | PE | Rao, 1975 | Vertical value |

References

Rao, 1975
Rao, C.N.R.,
Lone-pair ionization bands of chromophores in the photoelectron spectra of organic molecules,
Indian J. Chem., 1975, 13, 950. [all data]