2H-Tetrazole, 2-methyl-
- Formula: C2H4N4
- Molecular weight: 84.0800
- IUPAC Standard InChIKey: VRESBNUEIKZECD-UHFFFAOYSA-N
- CAS Registry Number: 16681-78-0
- Chemical structure:
View 3d structure (requires JavaScript / HTML 5) - Other names: 2-Methyltetrazole

Gas phase thermochemistry data

Data compiled by: Hussein Y. Afeefy, Joel F. Liebman, and Stephen E. Stein
Quantity | Value | Units | Method | Reference | Comment |
---|---|---|---|---|---|
ΔfH°gas | 328.4 ± 0.7 | kJ/mol | Ccb | Kozyro, Simirskii, et al., 1990 |

Condensed phase thermochemistry data

Data compiled by: Hussein Y. Afeefy, Joel F. Liebman, and Stephen E. Stein
Quantity | Value | Units | Method | Reference | Comment |
---|---|---|---|---|---|
ΔfH°liquid | 281.6 ± 0.6 | kJ/mol | Ccb | Kozyro, Simirskii, et al., 1990 | |
Quantity | Value | Units | Method | Reference | Comment |
ΔcH°liquid | -1640.2 ± 0.5 | kJ/mol | Ccb | Kozyro, Simirskii, et al., 1990 |

Phase change data

Data compiled as indicated in comments:
TRC - Thermodynamics Research Center, NIST Boulder Laboratories, Chris Muzny director
ALS - Hussein Y. Afeefy, Joel F. Liebman, and Stephen E. Stein
DRB - Donald R. Burgess, Jr.
AC - William E. Acree, Jr., James S. Chickos
Quantity | Value | Units | Method | Reference | Comment |
---|---|---|---|---|---|
Ttriple | 286. | K | N/A | Kozyro, Simirskii, et al., 1990, 2 | Uncertainty assigned by TRC = 1. K; Det. with triple heat bridge; TRC |
Quantity | Value | Units | Method | Reference | Comment |
ΔvapH° | 46.8 ± 0.4 | kJ/mol | C | Kozyro, Simirskii, et al., 1990 | ALS |
ΔvapH° | 46.8 | kJ/mol | N/A | Kozyro, Simirskii, et al., 1990 | DRB |
Enthalpy of fusion
ΔfusH (kJ/mol) | Temperature (K) | Reference | Comment |
---|---|---|---|
12.37 | 286. | Kozyro, Simirskii, et al., 1990, 3 | AC |

Gas phase ion energetics data

Data compiled by: Sharon G. Lias, Rhoda D. Levin, and Sherif A. Kafafi
Ionization energy determinations
IE (eV) | Method | Reference |
---|---|---|
10.0 | PE | Palmer, Simpson, et al., 1981 |

References

Kozyro, Simirskii, et al., 1990
Kozyro, A.A.; Simirskii, V.V.; Krasulin, A.P.; Sevruk, V.M.; Kabo, G.Ya.; Frenkel, M.L.; Gaponik, P.N.; Grigor'ev, Yu.V.,
Thermodynamic properties of tetrazole derivatives in different aggregation states,
Russ. J. Phys. Chem. (Engl. Transl.), 1990, 64, 348-350. [all data]
Kozyro, Simirskii, et al., 1990, 2
Kozyro, A.A.; Simirskii, V.V.; Kabo, G.Y.; Frenkel, M.L.; Krasulin, A.P.; Sevruk, V.M.; Sokolov, N.A.,
Additivity of the thermochemical characteristics of tetraalklyl-substituted carbamides,
Zh. Fiz. Khim., 1990, 64, 2360. [all data]
Kozyro, Simirskii, et al., 1990, 3
Kozyro, A.A.; Simirskii, V.V.; Krasulin, A.P.; Sevruk, V.M.; Kabo, G.Y.; Frenkel, M.L.; Gaponik, P.N.; Grigor'ev, Y.V.,
Thermodynamic properties of tetrazole derivatives in different aggregation states,
Zh. Fiz. Khim., 1990, 64, 656. [all data]
Palmer, Simpson, et al., 1981
Palmer, M.H.; Simpson, I.; Wheeler, J.R.,
Gas phase tautomerism in the triazoles and tetrazoles: A study by photoelectron spectroscopy and ab initio molecular orbital calculations,
Z. Naturforsch. A:, 1981, 36, 1246. [all data]