1-Methyl-1,2,3-triazole
- Formula: C3H5N3
- Molecular weight: 83.0919
- IUPAC Standard InChIKey: JWAWEQBUZOGIBZ-UHFFFAOYSA-N
- CAS Registry Number: 16681-65-5
- Chemical structure:
View 3d structure (requires JavaScript / HTML 5) - Permanent link for this species. Use this link for bookmarking this species for future reference.

Gas phase ion energetics data

Data compiled by: Sharon G. Lias, Rhoda D. Levin, and Sherif A. Kafafi
Ionization energy determinations
IE (eV) | Method | Reference |
---|---|---|
9.5 | PE | Palmer, Simpson, et al., 1981 |

References

Palmer, Simpson, et al., 1981
Palmer, M.H.; Simpson, I.; Wheeler, J.R.,
Gas phase tautomerism in the triazoles and tetrazoles: A study by photoelectron spectroscopy and ab initio molecular orbital calculations,
Z. Naturforsch. A:, 1981, 36, 1246. [all data]