Ethanone, 1-(2,4,6-trimethylphenyl)-
- Formula: C11H14O
- Molecular weight: 162.2283
- IUPAC Standard InChIKey: XWCIICLTKWRWCI-UHFFFAOYSA-N
- CAS Registry Number: 1667-01-2
- Chemical structure:
View 3d structure (requires JavaScript / HTML 5) - Other names: Acetophenone, 2',4',6'-trimethyl-; Acetomesitylene; Mesityl methyl ketone; Methyl 2,4,6-trimethylphenyl ketone; 2',4',6'-Trimethylacetophenone; 1-(2,4,6-Trimethylphenyl)-ethanone; 2,4,6-Trimethyl-acetophenone; Acetylmesitylene; 1,3,5-Trimethyl-2-acetylbenzene; 1-(2,4,6-Trimethylphenyl)-1-ethanone; 1-Acetyl-2,4,6-trimethylbenzene; Methyl mesityl ketone; NSC 65636

Gas phase thermochemistry data

Data compiled by: Hussein Y. Afeefy, Joel F. Liebman, and Stephen E. Stein
Quantity | Value | Units | Method | Reference | Comment |
---|---|---|---|---|---|
ΔfH°gas | -205. ± 4.2 | kJ/mol | Ccb | Baker and Tweed, 1941 | Heat of formation derived by Cox and Pilcher, 1970 |

Condensed phase thermochemistry data

Data compiled by: Hussein Y. Afeefy, Joel F. Liebman, and Stephen E. Stein
Quantity | Value | Units | Method | Reference | Comment |
---|---|---|---|---|---|
ΔfH°liquid | -267. ± 3. | kJ/mol | Ccb | Baker and Tweed, 1941 | Heat of formation derived by Cox and Pilcher, 1970 |
Quantity | Value | Units | Method | Reference | Comment |
ΔcH°liquid | -6062.2 ± 2.9 | kJ/mol | Ccb | Baker and Tweed, 1941 | Reanalyzed by Cox and Pilcher, 1970, Original value = -6060. ± 20. kJ/mol; Corresponding ΔfHºliquid = -267.2 kJ/mol (simple calculation by NIST; no Washburn corrections) |

Phase change data

Data compiled as indicated in comments:
BS - Robert L. Brown and Stephen E. Stein
ALS - Hussein Y. Afeefy, Joel F. Liebman, and Stephen E. Stein
DRB - Donald R. Burgess, Jr.
Quantity | Value | Units | Method | Reference | Comment |
---|---|---|---|---|---|
Tboil | 508.7 | K | N/A | Aldrich Chemical Company Inc., 1990 | BS |
Quantity | Value | Units | Method | Reference | Comment |
ΔvapH° | 62.3 ± 2.1 | kJ/mol | E | Baker and Tweed, 1941 | Reanalyzed by Cox and Pilcher, 1970, Original value = 44.27 kJ/mol; ALS |
ΔvapH° | 62.0 | kJ/mol | N/A | Baker and Tweed, 1941 | DRB |
Reduced pressure boiling point
Tboil (K) | Pressure (bar) | Reference | Comment |
---|---|---|---|
513.2 | 0.980 | Weast and Grasselli, 1989 | BS |

Gas phase ion energetics data

Data compiled as indicated in comments:
LLK - Sharon G. Lias, Rhoda D. Levin, and Sherif A. Kafafi
B - John E. Bartmess
Electron affinity determinations
EA (eV) | Method | Reference | Comment |
---|---|---|---|
0.490 ± 0.043 | ECD | Wentworth and Ristau, 1969 | B |
Ionization energy determinations
IE (eV) | Method | Reference | Comment |
---|---|---|---|
8.2 | PE | Centineo, Fragala, et al., 1978 | LLK |
8.50 | PE | Centineo, Fragala, et al., 1978 | Vertical value; LLK |

References

Baker and Tweed, 1941
Baker, J.W.; Tweed, W.T.,
Mechanism of aromatic side-chain reactions, with special reference to the polar effects of substituents. Part X. Physical and chemical evidence relating to the polar effect of o-methyl substituents in derivatives of the type C6H2Me3.CO.CH2R,
J. Chem. Soc., 1941, 796-802. [all data]
Cox and Pilcher, 1970
Cox, J.D.; Pilcher, G.,
Thermochemistry of Organic and Organometallic Compounds, Academic Press, New York, 1970, 1-636. [all data]
Aldrich Chemical Company Inc., 1990
Aldrich Chemical Company Inc.,
Catalog Handbook of Fine Chemicals, Aldrich Chemical Company, Inc., Milwaukee WI, 1990, 1. [all data]
Weast and Grasselli, 1989
CRC Handbook of Data on Organic Compounds, 2nd Editon, Weast,R.C and Grasselli, J.G., ed(s)., CRC Press, Inc., Boca Raton, FL, 1989, 1. [all data]
Wentworth and Ristau, 1969
Wentworth, W.E.; Ristau, W.,
Thermal Electron Attachment Involving a Change in Molecular Geometry,
J. Phys. Chem., 1969, 73, 7, 2126, https://doi.org/10.1021/j100727a005
. [all data]
Centineo, Fragala, et al., 1978
Centineo, G.; Fragala, I.; Bruno, G.; Spampinato, S.,
Photoelectron spectroscopy of benzophenone, acetophenone and their ortho-alkyl derivatives,
J. Mol. Struct., 1978, 44, 203. [all data]