(Z)-Hexa-1,5-diyne-3-ene
- Formula: C6H4
- Molecular weight: 76.0960
- IUPAC Standard InChIKey: KIWAUQFHKHLABA-WAYWQWQTSA-N
- CAS Registry Number: 16668-67-0
- Chemical structure:
View 3d structure (requires JavaScript / HTML 5) - Stereoisomers:

Gas phase thermochemistry data

Data compiled by: Hussein Y. Afeefy, Joel F. Liebman, and Stephen E. Stein
Quantity | Value | Units | Method | Reference | Comment |
---|---|---|---|---|---|
ΔfH°gas | 541.8 | kJ/mol | Chyd | Roth, Adamczak, et al., 1991 |

Reaction thermochemistry data

Data compiled by: Hussein Y. Afeefy, Joel F. Liebman, and Stephen E. Stein
Individual Reactions
By formula: 5H2 + C6H4 = C6H14
Quantity | Value | Units | Method | Reference | Comment |
---|---|---|---|---|---|
ΔrH° | -709. ± 2. | kJ/mol | Chyd | Roth, Adamczak, et al., 1991 | liquid phase |
By formula: C6H4 = C6H4
Quantity | Value | Units | Method | Reference | Comment |
---|---|---|---|---|---|
ΔrH° | 0.0 ± 5.9 | kJ/mol | Eqk | Roth, Hopf, et al., 1994 | gas phase; At 949 K |

Gas phase ion energetics data

Data compiled as indicated in comments:
LLK - Sharon G. Lias, Rhoda D. Levin, and Sherif A. Kafafi
Ionization energy determinations
IE (eV) | Method | Reference | Comment |
---|---|---|---|
9.10 ± 0.02 | PE | Bieri, Burger, et al., 1977 | LLK |
9.10 ± 0.02 | PE | Brogli, Heilbronner, et al., 1975 | LLK |

References

Roth, Adamczak, et al., 1991
Roth, W.R.; Adamczak, O.; Breuckmann, R.; Lennartz, H.-W.; Boese, R.,
Die Berechnung von Resonanzenergien; das MM2ERW-Kraftfeld,
Chem. Ber., 1991, 124, 2499-2521. [all data]
Roth, Hopf, et al., 1994
Roth, W.R.; Hopf, H.; Horn, C.,
Propargyl-Stabilisierungsenergie,
Chem. Ber., 1994, 127, 1781-1795. [all data]
Bieri, Burger, et al., 1977
Bieri, G.; Burger, F.; Heilbronner, E.; Maier, J.P.,
Valence ionization enrgies of hydrocarbons,
Helv. Chim. Acta, 1977, 60, 2213. [all data]
Brogli, Heilbronner, et al., 1975
Brogli, F.; Heilbronner, E.; Wirz, J.; Kloster-Jensen, E.; Bergman, R.G.; Vollhardt, K.P.C.; Ashe, A.J., III,
The consequences of σ and π conjugative interactions in mono-, di- and triacetylenes. A photoelectron spectroscopic investigation,
Helv. Chim. Acta, 1975, 58, 2620. [all data]