Silane, (methylthio)-
- Formula: CH6SSi
- Molecular weight: 78.209
- IUPAC Standard InChIKey: KMRKZWOJLUYLAM-UHFFFAOYSA-N
- CAS Registry Number: 16643-15-5
- Chemical structure:
View 3d structure (requires JavaScript / HTML 5) - Permanent link for this species. Use this link for bookmarking this species for future reference.

Gas phase ion energetics data

Data compiled by: Sharon G. Lias, Rhoda D. Levin, and Sherif A. Kafafi
Ionization energy determinations
IE (eV) | Method | Reference | Comment |
---|---|---|---|
9.10 | PE | Mollere, Bock, et al., 1973 | Vertical value |

References

Mollere, Bock, et al., 1973
Mollere, P.; Bock, H.; Becker, G.; Fritz, G.,
Photoelectron spectra and molecular properties. XXI. Dimethyl sulfide, methyl silyl sulfide, and disilyl sulfide,
J. Organomet. Chem., 1973, 61, 127. [all data]