2(1H)-Pyrimidinethione, tetrahydro-1,3-dimethyl-
- Formula: C6H12N2S
- Molecular weight: 144.238
- IUPAC Standard InChIKey: JILASYJQVXOLSP-UHFFFAOYSA-N
- CAS Registry Number: 16597-35-6
- Chemical structure:
View 3d structure (requires JavaScript / HTML 5) - Other names: N,N'-Dimethyltrimethylenethiourea; Tetrahydro-1,3-dimethyl-2(1H)-pyrimidinethione

Gas phase ion energetics data

Data compiled as indicated in comments:
LLK - Sharon G. Lias, Rhoda D. Levin, and Sherif A. Kafafi
Ionization energy determinations
IE (eV) | Method | Reference | Comment |
---|---|---|---|
7.3 | PE | Guimon, Gonbeau, et al., 1974 | LLK |
7.58 | PE | Guimon, Gonbeau, et al., 1974 | Vertical value; LLK |

References

Guimon, Gonbeau, et al., 1974
Guimon, C.; Gonbeau, D.; Pfister-Guillouzo, G.; Asbrink, L.; Sandstrom, J.,
Electronic structure of sulphur compounds. VI. Photoelectron spectra of some simple thiocarbonyl compounds,
J. Electron Spectrosc. Relat. Phenom., 1974, 4, 49. [all data]