Hydrazine, 1,1-bis(2-methylpropyl)-
- Formula: C8H20N2
- Molecular weight: 144.2578
- IUPAC Standard InChIKey: JDAGVHRXQORNKW-UHFFFAOYSA-N
- CAS Registry Number: 16596-38-6
- Chemical structure:
View 3d structure (requires JavaScript / HTML 5) - Other names: 1,1-di-Isobutylhydrazine

Gas phase ion energetics data

Data compiled by: Sharon G. Lias, Rhoda D. Levin, and Sherif A. Kafafi
Ionization energy determinations
IE (eV) | Method | Reference |
---|---|---|
7.73 ± 0.05 | PE | Vovna, Vilesov, et al., 1975 |

References

Vovna, Vilesov, et al., 1975
Vovna, V.I.; Vilesov, F.I.; Lopatin, S.N.,
Photoelectron spectra of hydrazine and some alkyl derivatives,
Opt. Spectrosc., 1975, 38, 143. [all data]