4(1H)-Pyridinimine, 1-methyl-
- Formula: C6H8N2
- Molecular weight: 108.1411
- CAS Registry Number: 16562-40-6

Gas phase ion energetics data

Data compiled by: Sharon G. Lias, Rhoda D. Levin, and Sherif A. Kafafi
Ionization energy determinations
IE (eV) | Method | Reference |
---|---|---|
7.85 ± 0.05 | EI | Gronneberg and Undheim, 1973 |

References

Gronneberg and Undheim, 1973
Gronneberg, T.; Undheim, K.,
Mass spectrometry of onium compounds - XV. ionization potentials of amino pyridines,
Tetrahedron Lett., 1973, 3193. [all data]