Disilathiane
- Formula: H6SSi2
- Molecular weight: 94.284
- IUPAC Standard InChIKey: FGEJJBGRIFKJTB-UHFFFAOYSA-N
- CAS Registry Number: 16544-95-9
- Chemical structure:
View 3d structure (requires JavaScript / HTML 5) - Permanent link for this species. Use this link for bookmarking this species for future reference.

Gas phase ion energetics data

Data compiled by: Sharon G. Lias, Rhoda D. Levin, and Sherif A. Kafafi
Ionization energy determinations
IE (eV) | Method | Reference | Comment |
---|---|---|---|
9.59 | PE | Mollere, Bock, et al., 1973 | Vertical value |
9.70 | PE | Cradock and Whiteford, 1972 | Vertical value |

References

Mollere, Bock, et al., 1973
Mollere, P.; Bock, H.; Becker, G.; Fritz, G.,
Photoelectron spectra and molecular properties. XXI. Dimethyl sulfide, methyl silyl sulfide, and disilyl sulfide,
J. Organomet. Chem., 1973, 61, 127. [all data]
Cradock and Whiteford, 1972
Cradock, S.; Whiteford, R.A.,
Photoelectron spectra of the methyl, silyl and germyl derivatives of the group VI elements,
J. Chem. Soc. Faraday Trans. 2, 1972, 68, 281. [all data]