Cyclopentene, 1,5-dimethyl-
- Formula: C7H12
- Molecular weight: 96.1702
- IUPAC Standard InChIKey: RIICRLQIUAAOOE-UHFFFAOYSA-N
- CAS Registry Number: 16491-15-9
- Chemical structure:
View 3d structure (requires JavaScript / HTML 5) - Other names: 1,2-Dimethyl-2-cyclopentene; 1,5-Dimethylcyclopentene; 2,3-Dimethylcyclopentene

Phase change data

Data compiled as indicated in comments:
BS - Robert L. Brown and Stephen E. Stein
TRC - Thermodynamics Research Center, NIST Boulder Laboratories, Chris Muzny director
AC - William E. Acree, Jr., James S. Chickos
Quantity | Value | Units | Method | Reference | Comment |
---|---|---|---|---|---|
Tboil | 375.2 | K | N/A | Weast and Grasselli, 1989 | BS |
Tboil | 365.7 | K | N/A | Adkins and Roebuck, 1948 | Uncertainty assigned by TRC = 3. K; TRC |
Tboil | 368.9 | K | N/A | Chavanne and Chiurdoglu, 1942 | Uncertainty assigned by TRC = 3. K; TRC |
Quantity | Value | Units | Method | Reference | Comment |
Tfus | 154.7 | K | N/A | Timmermans, 1952 | Uncertainty assigned by TRC = 0.5 K; TRC |
Enthalpy of vaporization
ΔvapH (kJ/mol) | Temperature (K) | Method | Reference | Comment |
---|---|---|---|---|
37.1 | 288. | A | Stephenson and Malanowski, 1987 | Based on data from 273. to 423. K. See also Kkykj and Repas, 1973.; AC |

Gas phase ion energetics data

Data compiled by: Sharon G. Lias, John E. Bartmess, Joel F. Liebman, John L. Holmes, Rhoda D. Levin, and W. Gary Mallard
Appearance energy determinations
Ion | AE (eV) | Other Products | Method | Reference | Comment |
---|---|---|---|---|---|
C6H9+ | 10.00 | CH3 | EI | Lossing and Holmes, 1984 |

References

Weast and Grasselli, 1989
CRC Handbook of Data on Organic Compounds, 2nd Editon, Weast,R.C and Grasselli, J.G., ed(s)., CRC Press, Inc., Boca Raton, FL, 1989, 1. [all data]
Adkins and Roebuck, 1948
Adkins, H.; Roebuck, A.K.,
Isomerization of Cyclohexenes to Cyclopentenes: Oxidation of These Alkenes to Glycols and Acids.,
J. Am. Chem. Soc., 1948, 70, 4041. [all data]
Chavanne and Chiurdoglu, 1942
Chavanne, G.; Chiurdoglu, G.,
The Ring Enlargement which Accompanies the Water Removal from Dimethylcyclobutylcarbinol,
Bull. Soc. Chim. Belg., 1942, 51, 11-22. [all data]
Timmermans, 1952
Timmermans, J.,
Freezing points of organic compounds. VVI New determinations.,
Bull. Soc. Chim. Belg., 1952, 61, 393. [all data]
Stephenson and Malanowski, 1987
Stephenson, Richard M.; Malanowski, Stanislaw,
Handbook of the Thermodynamics of Organic Compounds, 1987, https://doi.org/10.1007/978-94-009-3173-2
. [all data]
Kkykj and Repas, 1973
Kkykj, J.; Repas, M.,
Petrochemia, 1973, 13, 179. [all data]
Lossing and Holmes, 1984
Lossing, F.P.; Holmes, J.L.,
Stabilization energy and ion size in carbocations in the gas phase,
J. Am. Chem. Soc., 1984, 106, 6917. [all data]