Ethane, 1,2-dichloro-1,1-difluoro-
- Formula: C2H2Cl2F2
- Molecular weight: 134.940
- IUPAC Standard InChIKey: SKDFWEPBABSFMG-UHFFFAOYSA-N
- CAS Registry Number: 1649-08-7
- Chemical structure:
View 3d structure (requires JavaScript / HTML 5) - Other names: 1,1-Difluoro-1,2-dichloroethane; 1,2-Dichloro-1,1-difluoroethane; CF2ClCH2Cl; Hcfc-132b

Phase change data

Data compiled as indicated in comments:
BS - Robert L. Brown and Stephen E. Stein
AC - William E. Acree, Jr., James S. Chickos
Quantity | Value | Units | Method | Reference | Comment |
---|---|---|---|---|---|
Tboil | 319. to 320. | K | N/A | PCR Inc., 1990 | BS |
Tboil | 320.0 | K | N/A | Weast and Grasselli, 1989 | BS |
Enthalpy of vaporization
ΔvapH (kJ/mol) | Temperature (K) | Method | Reference | Comment |
---|---|---|---|---|
27.8 | 338. | A | Stephenson and Malanowski, 1987 | Based on data from 323. to 493. K.; AC |

Gas phase ion energetics data

Data compiled as indicated in comments:
LLK - Sharon G. Lias, Rhoda D. Levin, and Sherif A. Kafafi
Ionization energy determinations
IE (eV) | Method | Reference | Comment |
---|---|---|---|
11.8 | PE | Dumas, Dupuis, et al., 1981 | Vertical value; LLK |

References

PCR Inc., 1990
PCR Inc.,
Research Chemicals Catalog 1990-1991, PCR Inc., Gainesville, FL, 1990, 1. [all data]
Weast and Grasselli, 1989
CRC Handbook of Data on Organic Compounds, 2nd Editon, Weast,R.C and Grasselli, J.G., ed(s)., CRC Press, Inc., Boca Raton, FL, 1989, 1. [all data]
Stephenson and Malanowski, 1987
Stephenson, Richard M.; Malanowski, Stanislaw,
Handbook of the Thermodynamics of Organic Compounds, 1987, https://doi.org/10.1007/978-94-009-3173-2
. [all data]
Dumas, Dupuis, et al., 1981
Dumas, J.-M.; Dupuis, P.; Pfister-Guillouzo, G.; Sandorfy, C.,
Ionization potentials and ultraviolet absorption spectra of fluorocarbon anesthetics,
Can. J. Spectrosc., 1981, 26, 102. [all data]